FailedConsole Output

定期的に実行
ビルドします。 ワークスペース: /home/services/jenkins/jobs/s2dao-1.0.x/workspace
Updating https://www.seasar.org/svn/s2dao/branches/s2dao-1.0.x at revision '2014-05-03T02:50:35.714 +0900'
At revision 1334
no change for https://www.seasar.org/svn/s2dao/branches/s2dao-1.0.x since the previous build
[s2dao-1.0.x] $ /home/services/jenkins/tools/hudson.tasks.Maven_MavenInstallation/MAVEN-2.0/bin/mvn clean install
[INFO] Scanning for projects...
[INFO] Reactor build order: 
[INFO]   S2Dao Project
[INFO]   S2Dao
[INFO]   S2Dao Examples
[INFO]   S2Dao tests for Seasar2.4.x
WAGON_VERSION: 1.0-beta-2
[INFO] ------------------------------------------------------------------------
[INFO] Building S2Dao Project
[INFO]    task-segment: [clean, install]
[INFO] ------------------------------------------------------------------------
[INFO] [clean:clean]
[INFO] [site:attach-descriptor]
[INFO] Preparing source:jar
[WARNING] Removing: jar from forked lifecycle, to prevent recursive invocation.
[INFO] No goals needed for project - skipping
[INFO] [source:jar {execution: source-jar}]
[INFO] [install:install]
[INFO] Installing /home/services/jenkins/jobs/s2dao-1.0.x/workspace/s2dao-1.0.x/pom.xml to /home/services/jenkins/.m2/repository/org/seasar/dao/s2-dao-project/1.0.52-SNAPSHOT/s2-dao-project-1.0.52-SNAPSHOT.pom
[INFO] ------------------------------------------------------------------------
[INFO] Building S2Dao
[INFO]    task-segment: [clean, install]
[INFO] ------------------------------------------------------------------------
[INFO] [clean:clean]
[INFO] Deleting directory /home/services/jenkins/jobs/s2dao-1.0.x/workspace/s2dao-1.0.x/s2-dao/target
[INFO] [resources:resources]
[WARNING] Using platform encoding (UTF-8 actually) to copy filtered resources, i.e. build is platform dependent!
[INFO] Copying 4 resources
[INFO] [compiler:compile]
[INFO] Compiling 213 source files to /home/services/jenkins/jobs/s2dao-1.0.x/workspace/s2dao-1.0.x/s2-dao/target/classes
[INFO] [resources:testResources]
[WARNING] Using platform encoding (UTF-8 actually) to copy filtered resources, i.e. build is platform dependent!
[INFO] Copying 120 resources
[INFO] [compiler:testCompile]
[INFO] Compiling 174 source files to /home/services/jenkins/jobs/s2dao-1.0.x/workspace/s2dao-1.0.x/s2-dao/target/test-classes
[INFO] [surefire:test]
[INFO] Surefire report directory: /home/services/jenkins/jobs/s2dao-1.0.x/workspace/s2dao-1.0.x/s2-dao/target/surefire-reports
/bin/sh: fork: retry: リソースが一時的に利用できません
/bin/sh: fork: retry: リソースが一時的に利用できません
/bin/sh: fork: retry: リソースが一時的に利用できません
/bin/sh: fork: retry: リソースが一時的に利用できません
/bin/sh: fork: リソースが一時的に利用できません
[INFO] ------------------------------------------------------------------------
[ERROR] BUILD FAILURE
[INFO] ------------------------------------------------------------------------
[INFO] There are test failures.

Please refer to /home/services/jenkins/jobs/s2dao-1.0.x/workspace/s2dao-1.0.x/s2-dao/target/surefire-reports for the individual test results.
[INFO] ------------------------------------------------------------------------
[INFO] For more information, run Maven with the -e switch
[INFO] ------------------------------------------------------------------------
[INFO] Total time: 23 seconds
[INFO] Finished at: Sat May 03 02:51:00 JST 2014
[INFO] Final Memory: 16M/41M
[INFO] ------------------------------------------------------------------------
Build step 'Mavenの呼び出し' marked build as failure
[WARNINGS] Skipping publisher since build result is FAILURE
[TASKS] Skipping publisher since build result is FAILURE
[PMD] Skipping publisher since build result is FAILURE
[CHECKSTYLE] Skipping publisher since build result is FAILURE
[FINDBUGS] Skipping publisher since build result is FAILURE
テスト結果を保存中
Sending e-mails to: nakamura.toshihiro@isid.co.jp azusa@fieldnotes.jp
Warning: you have no plugins providing access control for builds, so falling back to legacy behavior of permitting any downstream builds to be triggered
Finished: FAILURE