Console Output

上流プロジェクト"s2container-2.4-seasar2"の#4924が実行 
元の原因: 
 定期的に実行
Running as SYSTEM
ビルドします。 ワークスペース: /home/services/jenkins/jobs/s2container-2.4-s2tiger/workspace
The recommended git tool is: NONE
No credentials specified
 > git rev-parse --resolve-git-dir /home/services/jenkins/jobs/s2container-2.4-s2tiger/workspace/.git # timeout=10
Fetching changes from the remote Git repository
 > git config remote.origin.url https://github.com/seasarorg/seasar2.git # timeout=10
Fetching upstream changes from https://github.com/seasarorg/seasar2.git
 > git --version # timeout=10
 > git --version # 'git version 1.7.1'
 > git fetch --tags --progress https://github.com/seasarorg/seasar2.git +refs/heads/*:refs/remotes/origin/* # timeout=10
 > git rev-parse refs/remotes/origin/master^{commit} # timeout=10
Checking out Revision db46d1f5891159eb5ef6aab3a40af7b0e0885377 (refs/remotes/origin/master)
 > git config core.sparsecheckout # timeout=10
 > git checkout -f db46d1f5891159eb5ef6aab3a40af7b0e0885377 # timeout=10
Commit message: "Merge branch 'jfut-cleanup-test-file'"
 > git rev-list --no-walk db46d1f5891159eb5ef6aab3a40af7b0e0885377 # timeout=10
Parsing POMs
Established TCP socket on 45966
[s2-tiger] $ /home/services/jenkins/tools/hudson.model.JDK/JDK-1.5/bin/java -cp /home/services/jenkins/plugins/maven-plugin/WEB-INF/lib/maven-agent-1.13.jar:/home/services/jenkins/tools/hudson.tasks.Maven_MavenInstallation/MAVEN-2.0.9/boot/classworlds-1.1.jar hudson.maven.agent.Main /home/services/jenkins/tools/hudson.tasks.Maven_MavenInstallation/MAVEN-2.0.9 /var/cache/jenkins/war/WEB-INF/lib/remoting-4.11.2.jar /home/services/jenkins/plugins/maven-plugin/WEB-INF/lib/maven-interceptor-1.13.jar 45966
Exception in thread "main" java.lang.UnsupportedClassVersionError: Bad version number in .class file
	at java.lang.ClassLoader.defineClass1(Native Method)
	at java.lang.ClassLoader.defineClass(ClassLoader.java:621)
	at java.security.SecureClassLoader.defineClass(SecureClassLoader.java:124)
	at java.net.URLClassLoader.defineClass(URLClassLoader.java:260)
	at java.net.URLClassLoader.access$100(URLClassLoader.java:56)
	at java.net.URLClassLoader$1.run(URLClassLoader.java:195)
	at java.security.AccessController.doPrivileged(Native Method)
	at java.net.URLClassLoader.findClass(URLClassLoader.java:188)
	at java.lang.ClassLoader.loadClass(ClassLoader.java:307)
	at org.codehaus.classworlds.RealmClassLoader.loadClassDirect(RealmClassLoader.java:195)
	at org.codehaus.classworlds.DefaultClassRealm.loadClass(DefaultClassRealm.java:255)
	at hudson.maven.agent.Main.main(Main.java:145)
	at hudson.maven.agent.Main.main(Main.java:69)
ERROR: ================================================================================
ERROR: Invalid project setup: Connection reset
ERROR: [JENKINS-18403][JENKINS-28294] JDK 'JDK-1.5' not supported to run Maven projects.
ERROR: Maven projects have to be launched with a Java version greater or equal to the minimum version required by the controller.
ERROR: Use the Maven JDK Toolchains (plugin) to build your maven project with an older JDK.
ERROR: Retrying with agent Java and setting compile/test properties to point to /home/services/jenkins/tools/hudson.model.JDK/JDK-1.5.
ERROR: ================================================================================
Established TCP socket on 39637
[s2-tiger] $ /usr/local/java/jdk1.8.0_202/jre/bin/java -cp /home/services/jenkins/plugins/maven-plugin/WEB-INF/lib/maven-agent-1.13.jar:/home/services/jenkins/tools/hudson.tasks.Maven_MavenInstallation/MAVEN-2.0.9/boot/classworlds-1.1.jar hudson.maven.agent.Main /home/services/jenkins/tools/hudson.tasks.Maven_MavenInstallation/MAVEN-2.0.9 /var/cache/jenkins/war/WEB-INF/lib/remoting-4.11.2.jar /home/services/jenkins/plugins/maven-plugin/WEB-INF/lib/maven-interceptor-1.13.jar 39637
<===[JENKINS REMOTING CAPACITY]===>channel started
Executing Maven:  -B -f /home/services/jenkins/jobs/s2container-2.4-s2tiger/workspace/s2-tiger/pom.xml clean install
[INFO] Scanning for projects...
WAGON_VERSION: 1.0-beta-2
[INFO] ------------------------------------------------------------------------
[INFO] Building S2 Tiger
[INFO]    task-segment: [clean, install]
[INFO] ------------------------------------------------------------------------
[INFO] [clean:clean]
[INFO] Deleting directory /home/services/jenkins/jobs/s2container-2.4-s2tiger/workspace/s2-tiger/target
[INFO] [resources:resources]
[INFO] Using default encoding to copy filtered resources.
[INFO] snapshot org.seasar.container:s2-extension:2.4.49-SNAPSHOT: checking for updates from maven.seasar.org
[INFO] snapshot org.seasar.container:s2-framework:2.4.49-SNAPSHOT: checking for updates from maven.seasar.org
[INFO] [compiler:compile]
[INFO] Compiling 473 source files to /home/services/jenkins/jobs/s2container-2.4-s2tiger/workspace/s2-tiger/target/classes
ERROR: Could not find local repository for 2.0.9
Started calculate disk usage of build
Finished Calculation of disk usage of build in 0 seconds
Started calculate disk usage of workspace
Finished Calculation of disk usage of workspace in 0 seconds
[INFO] ------------------------------------------------------------------------
[ERROR] BUILD FAILURE
[INFO] ------------------------------------------------------------------------
[INFO] Compilation failure
/home/services/jenkins/jobs/s2container-2.4-s2tiger/workspace/s2-tiger/src/main/java/org/seasar/extension/jdbc/dialect/PostgreDialect.java:[252,18] エラー: BlobImplはabstractでなく、Blob内のabstractメソッドgetBinaryStream(long,long)をオーバーライドしません



/home/services/jenkins/jobs/s2container-2.4-s2tiger/workspace/s2-tiger/src/main/java/org/seasar/extension/jdbc/dialect/PostgreDialect.java:[252,18] エラー: BlobImplはabstractでなく、Blob内のabstractメソッドgetBinaryStream(long,long)をオーバーライドしません


[INFO] ------------------------------------------------------------------------
[INFO] For more information, run Maven with the -e switch
[INFO] ------------------------------------------------------------------------
[INFO] Total time: 4 seconds
[INFO] Finished at: Wed Dec 08 01:04:38 JST 2021
[INFO] Final Memory: 24M/246M
[INFO] ------------------------------------------------------------------------
[JENKINS] Archiving /home/services/jenkins/jobs/s2container-2.4-s2tiger/workspace/s2-tiger/pom.xml to org.seasar.container/s2-tiger/2.4.49-SNAPSHOT/s2-tiger-2.4.49-SNAPSHOT.pom
channel stopped
Started calculate disk usage of build
Finished Calculation of disk usage of build in 0 seconds
Started calculate disk usage of workspace
Finished Calculation of disk usage of workspace in 0 seconds
Finished: FAILURE