Console Output

ユーザーjfutが実行
Running as SYSTEM
ビルドします。 ワークスペース: /home/services/jenkins/jobs/maven-codegen-plugin/workspace
Reverting /home/services/jenkins/jobs/maven-codegen-plugin/workspace/maven-codegen-plugin to depth infinity with ignoreExternals: false
Updating https://www.seasar.org/svn/sandbox/s2dao-codegen/trunk/maven-codegen-plugin at revision '2021-11-04T09:04:39.381 +0900'
At revision 856

No changes for https://www.seasar.org/svn/sandbox/s2dao-codegen/trunk/maven-codegen-plugin since the previous build
[maven-codegen-plugin] $ /home/services/jenkins/tools/hudson.tasks.Maven_MavenInstallation/MAVEN-2.0/bin/mvn clean install
[INFO] Scanning for projects...
[INFO] ------------------------------------------------------------------------
[INFO] Building maven-codegen-plugin Maven Mojo
[INFO]    task-segment: [clean, install]
[INFO] ------------------------------------------------------------------------
[INFO] [clean:clean]
[INFO] Deleting directory /home/services/jenkins/jobs/maven-codegen-plugin/workspace/maven-codegen-plugin/target
[INFO] snapshot org.seasar.dao-codegen:s2dao-codegen-core:0.4.2.1-SNAPSHOT: checking for updates from maven.seasar.org
[INFO] snapshot org.seasar.dao-codegen:s2dao-codegen-core:0.4.2.1-SNAPSHOT: checking for updates from maven.snapshot.seasar.org
[WARNING] *** CHECKSUM FAILED - Checksum failed on download: local = 'c4c47e56ee2bd6d5a980d993225ae48853ec7b92'; remote = '7d23c0ef8ee7f63c22c133053c824fd785083455' - RETRYING
[WARNING] *** CHECKSUM FAILED - Checksum failed on download: local = 'c4c47e56ee2bd6d5a980d993225ae48853ec7b92'; remote = '7d23c0ef8ee7f63c22c133053c824fd785083455' - IGNORING
[INFO] artifact org.codehaus.woodstox:stax2-api: checking for updates from maven.seasar.org
[INFO] artifact org.codehaus.woodstox:stax2-api: checking for updates from maven.snapshot.seasar.org
[INFO] artifact org.codehaus.woodstox:stax2-api: checking for updates from codehaus
[WARNING] repository metadata for: 'artifact org.codehaus.woodstox:stax2-api' could not be retrieved from repository: codehaus due to an error: Error transferring file
[INFO] Repository 'codehaus' will be blacklisted
[INFO] artifact org.codehaus.woodstox:stax2-api: checking for updates from maven
[WARNING] repository metadata for: 'artifact org.codehaus.woodstox:stax2-api' could not be retrieved from repository: maven due to an error: Error transferring file
[INFO] Repository 'maven' will be blacklisted
[INFO] artifact org.codehaus.woodstox:stax2-api: checking for updates from central
[WARNING] repository metadata for: 'artifact org.codehaus.woodstox:stax2-api' could not be retrieved from repository: central due to an error: Error transferring file
[INFO] Repository 'central' will be blacklisted
[INFO] [plugin:descriptor]
[INFO] Using 2 extractors.
[INFO] Applying extractor for language: java
[INFO] Extractor for language: java found 1 mojo descriptors.
[INFO] Applying extractor for language: bsh
[INFO] Extractor for language: bsh found 0 mojo descriptors.
[INFO] [resources:resources]
[WARNING] Using platform encoding (UTF-8 actually) to copy filtered resources, i.e. build is platform dependent!
[INFO] Copying 3 resources
[INFO] [compiler:compile]
[INFO] Compiling 1 source file to /home/services/jenkins/jobs/maven-codegen-plugin/workspace/maven-codegen-plugin/target/classes
[INFO] [resources:testResources]
[WARNING] Using platform encoding (UTF-8 actually) to copy filtered resources, i.e. build is platform dependent!
[INFO] Copying 11 resources
[INFO] [compiler:testCompile]
[INFO] Compiling 1 source file to /home/services/jenkins/jobs/maven-codegen-plugin/workspace/maven-codegen-plugin/target/test-classes
[INFO] [surefire:test]
[INFO] Surefire report directory: /home/services/jenkins/jobs/maven-codegen-plugin/workspace/maven-codegen-plugin/target/surefire-reports

-------------------------------------------------------
 T E S T S
-------------------------------------------------------
Running org.seasar.codegen.maven.CodegenMojoTest
09:04:48,377 |-INFO in ch.qos.logback.classic.LoggerContext[default] - Could NOT find resource [logback.groovy]
09:04:48,378 |-INFO in ch.qos.logback.classic.LoggerContext[default] - Could NOT find resource [logback-test.xml]
09:04:48,378 |-INFO in ch.qos.logback.classic.LoggerContext[default] - Found resource [logback.xml] at [file:/home/services/jenkins/jobs/maven-codegen-plugin/workspace/maven-codegen-plugin/target/classes/logback.xml]
09:04:48,378 |-WARN in ch.qos.logback.classic.LoggerContext[default] - Resource [logback.xml] occurs multiple times on the classpath.
09:04:48,378 |-WARN in ch.qos.logback.classic.LoggerContext[default] - Resource [logback.xml] occurs at [file:/home/services/jenkins/jobs/maven-codegen-plugin/workspace/maven-codegen-plugin/target/classes/logback.xml]
09:04:48,378 |-WARN in ch.qos.logback.classic.LoggerContext[default] - Resource [logback.xml] occurs at [jar:file:/home/services/jenkins/.m2/repository/org/seasar/dao-codegen/s2dao-codegen-core/0.4.2.1-SNAPSHOT/s2dao-codegen-core-0.4.2.1-SNAPSHOT.jar!/logback.xml]
09:04:48,475 |-INFO in ch.qos.logback.classic.joran.action.ConfigurationAction - debug attribute not set
09:04:48,493 |-INFO in ch.qos.logback.core.joran.action.AppenderAction - About to instantiate appender of type [ch.qos.logback.core.ConsoleAppender]
09:04:48,505 |-INFO in ch.qos.logback.core.joran.action.AppenderAction - Naming appender as [STDOUT]
09:04:48,631 |-WARN in ch.qos.logback.core.ConsoleAppender[STDOUT] - This appender no longer admits a layout as a sub-component, set an encoder instead.
09:04:48,631 |-WARN in ch.qos.logback.core.ConsoleAppender[STDOUT] - To ensure compatibility, wrapping your layout in LayoutWrappingEncoder.
09:04:48,631 |-WARN in ch.qos.logback.core.ConsoleAppender[STDOUT] - See also http://logback.qos.ch/codes.html#layoutInsteadOfEncoder for details
09:04:48,632 |-INFO in ch.qos.logback.classic.joran.action.LevelAction - ROOT level set to WARN
09:04:48,632 |-INFO in ch.qos.logback.core.joran.action.AppenderRefAction - Attaching appender named [STDOUT] to Logger[ROOT]
09:04:48,633 |-INFO in ch.qos.logback.classic.joran.action.LevelAction - org.jiemamy level set to INFO
09:04:48,633 |-INFO in ch.qos.logback.classic.joran.action.LevelAction - org.seasar level set to DEBUG

09:04:48.716 JST [main] DEBUG o.s.f.c.factory.S2ContainerFactory - S2Containerを作成します。path=app_gen.dicon
09:04:48.760 JST [main] DEBUG o.s.f.c.factory.S2ContainerFactory - S2Containerを作成します。path=org/seasar/codegen/impl/ConditionOutputCode.dicon
09:04:48.762 JST [main] DEBUG o.s.f.c.factory.S2ContainerFactory - S2Containerを作成します。path=CodeGen.dicon
09:04:48.770 JST [main] DEBUG o.s.f.c.factory.S2ContainerFactory - S2Containerを作成します。path=j2ee.dicon
09:04:48.776 JST [main] DEBUG o.s.f.c.factory.S2ContainerFactory - S2Containerを作成します。path=jta.dicon
09:04:48.860 JST [main] DEBUG o.s.f.c.factory.S2ContainerFactory - S2Containerを作成しました。path=jta.dicon
09:04:48.866 JST [main] DEBUG o.s.f.c.factory.S2ContainerFactory - S2Containerを作成します。path=jdbc.dicon
09:04:48.869 JST [main] DEBUG o.s.f.c.factory.S2ContainerFactory - S2Containerを作成します。path=jdbc-extension.dicon
09:04:48.872 JST [main] DEBUG o.s.f.c.factory.S2ContainerFactory - S2Containerを作成します。path=convention.dicon
09:04:48.924 JST [main] DEBUG o.s.f.c.factory.S2ContainerFactory - S2Containerを作成しました。path=convention.dicon
09:04:48.928 JST [main] DEBUG o.s.f.c.factory.S2ContainerFactory - S2Containerを作成しました。path=jdbc-extension.dicon
09:04:48.968 JST [main] DEBUG o.s.f.c.factory.S2ContainerFactory - S2Containerを作成しました。path=jdbc.dicon
09:04:48.973 JST [main] DEBUG o.s.f.c.factory.S2ContainerFactory - S2Containerを作成しました。path=j2ee.dicon
09:04:48.976 JST [main] DEBUG o.s.f.c.factory.S2ContainerFactory - S2Containerを作成します。path=internal.dicon
09:04:48.990 JST [main] DEBUG o.s.f.c.factory.S2ContainerFactory - S2Containerを作成しました。path=internal.dicon
09:04:48.990 JST [main] DEBUG o.s.f.c.factory.S2ContainerFactory - S2Containerを作成しました。path=CodeGen.dicon
09:04:49.005 JST [main] DEBUG o.s.f.c.factory.S2ContainerFactory - S2Containerを作成しました。path=org/seasar/codegen/impl/ConditionOutputCode.dicon
09:04:49.006 JST [main] DEBUG o.s.f.c.factory.S2ContainerFactory - S2Containerを作成します。path=org/seasar/codegen/impl/RelationConditionOutputCode.dicon
09:04:49.013 JST [main] DEBUG o.s.f.c.factory.S2ContainerFactory - S2Containerを作成しました。path=org/seasar/codegen/impl/RelationConditionOutputCode.dicon
09:04:49.013 JST [main] DEBUG o.s.f.c.factory.S2ContainerFactory - S2Containerを作成します。path=org/seasar/codegen/impl/CoreDaoOutputCode.dicon
09:04:49.019 JST [main] DEBUG o.s.f.c.factory.S2ContainerFactory - S2Containerを作成しました。path=org/seasar/codegen/impl/CoreDaoOutputCode.dicon
09:04:49.020 JST [main] DEBUG o.s.f.c.factory.S2ContainerFactory - S2Containerを作成します。path=org/seasar/codegen/impl/NormalDaoOutputCode.dicon
09:04:49.026 JST [main] DEBUG o.s.f.c.factory.S2ContainerFactory - S2Containerを作成しました。path=org/seasar/codegen/impl/NormalDaoOutputCode.dicon
09:04:49.026 JST [main] DEBUG o.s.f.c.factory.S2ContainerFactory - S2Containerを作成します。path=org/seasar/codegen/impl/AbstractDtoOutputCode.dicon
09:04:49.031 JST [main] DEBUG o.s.f.c.factory.S2ContainerFactory - S2Containerを作成しました。path=org/seasar/codegen/impl/AbstractDtoOutputCode.dicon
09:04:49.031 JST [main] DEBUG o.s.f.c.factory.S2ContainerFactory - S2Containerを作成します。path=org/seasar/codegen/impl/AbstractRelationEntityOutputCode.dicon
09:04:49.036 JST [main] DEBUG o.s.f.c.factory.S2ContainerFactory - S2Containerを作成しました。path=org/seasar/codegen/impl/AbstractRelationEntityOutputCode.dicon
09:04:49.036 JST [main] DEBUG o.s.f.c.factory.S2ContainerFactory - S2Containerを作成します。path=org/seasar/codegen/impl/NormalEntityOutputCode.dicon
09:04:49.053 JST [main] DEBUG o.s.f.c.factory.S2ContainerFactory - S2Containerを作成しました。path=org/seasar/codegen/impl/NormalEntityOutputCode.dicon
09:04:49.062 JST [main] DEBUG o.s.f.c.factory.S2ContainerFactory - S2Containerを作成します。path=org/seasar/codegen/impl/NormalDiconOutputCode.dicon
09:04:49.080 JST [main] DEBUG o.s.f.c.factory.S2ContainerFactory - S2Containerを作成しました。path=org/seasar/codegen/impl/NormalDiconOutputCode.dicon
09:04:49.084 JST [main] DEBUG o.s.f.c.factory.S2ContainerFactory - S2Containerを作成します。path=org/seasar/codegen/impl/RelationEntityOutputCode.dicon
09:04:49.089 JST [main] DEBUG o.s.f.c.factory.S2ContainerFactory - S2Containerを作成しました。path=org/seasar/codegen/impl/RelationEntityOutputCode.dicon
09:04:49.090 JST [main] DEBUG o.s.f.c.factory.S2ContainerFactory - S2Containerを作成します。path=org/seasar/codegen/impl/CreateTable.dicon
09:04:49.115 JST [main] DEBUG o.s.f.c.factory.S2ContainerFactory - S2Containerを作成しました。path=org/seasar/codegen/impl/CreateTable.dicon
09:04:49.115 JST [main] DEBUG o.s.f.c.factory.S2ContainerFactory - S2Containerを作成します。path=org/seasar/codegen/impl/dropTable.dicon
09:04:49.120 JST [main] DEBUG o.s.f.c.factory.S2ContainerFactory - S2Containerを作成しました。path=org/seasar/codegen/impl/dropTable.dicon
09:04:49.121 JST [main] DEBUG o.s.f.c.factory.S2ContainerFactory - S2Containerを作成しました。path=app_gen.dicon
09:04:49.126 JST [main] DEBUG o.s.f.c.factory.S2ContainerFactory - S2Containerを作成します。path=CodeGen.dicon
09:04:49.128 JST [main] DEBUG o.s.f.c.factory.S2ContainerFactory - S2Containerを作成します。path=j2ee.dicon
09:04:49.130 JST [main] DEBUG o.s.f.c.factory.S2ContainerFactory - S2Containerを作成します。path=jta.dicon
09:04:49.134 JST [main] DEBUG o.s.f.c.factory.S2ContainerFactory - S2Containerを作成しました。path=jta.dicon
09:04:49.135 JST [main] DEBUG o.s.f.c.factory.S2ContainerFactory - S2Containerを作成します。path=jdbc.dicon
09:04:49.137 JST [main] DEBUG o.s.f.c.factory.S2ContainerFactory - S2Containerを作成します。path=jdbc-extension.dicon
09:04:49.150 JST [main] DEBUG o.s.f.c.factory.S2ContainerFactory - S2Containerを作成します。path=convention.dicon
09:04:49.156 JST [main] DEBUG o.s.f.c.factory.S2ContainerFactory - S2Containerを作成しました。path=convention.dicon
09:04:49.157 JST [main] DEBUG o.s.f.c.factory.S2ContainerFactory - S2Containerを作成しました。path=jdbc-extension.dicon
09:04:49.178 JST [main] DEBUG o.s.f.c.factory.S2ContainerFactory - S2Containerを作成しました。path=jdbc.dicon
09:04:49.180 JST [main] DEBUG o.s.f.c.factory.S2ContainerFactory - S2Containerを作成しました。path=j2ee.dicon
09:04:49.182 JST [main] DEBUG o.s.f.c.factory.S2ContainerFactory - S2Containerを作成します。path=internal.dicon
09:04:49.193 JST [main] DEBUG o.s.f.c.factory.S2ContainerFactory - S2Containerを作成しました。path=internal.dicon
09:04:49.199 JST [main] DEBUG o.s.f.c.factory.S2ContainerFactory - S2Containerを作成しました。path=CodeGen.dicon
09:04:49.581 JST [main] WARN  o.j.serializer.stax.StaxDirector - can not found deserialization handler : {http://jiemamy.org/xml/ns/sql}sqls
09:04:49.582 JST [main] WARN  o.j.serializer.stax.StaxDirector - can not found deserialization handler : {http://jiemamy.org/xml/ns/diagram}diagrams
log4j:WARN No appenders could be found for logger (freemarker.cache).
log4j:WARN Please initialize the log4j system properly.
09:04:49.816 JST [main] WARN  o.j.serializer.stax.StaxDirector - can not found deserialization handler : {http://jiemamy.org/xml/ns/sql}sqls
09:04:49.816 JST [main] WARN  o.j.serializer.stax.StaxDirector - can not found deserialization handler : {http://jiemamy.org/xml/ns/diagram}diagrams
09:04:49.882 JST [main] WARN  o.j.serializer.stax.StaxDirector - can not found deserialization handler : {http://jiemamy.org/xml/ns/sql}sqls
09:04:49.883 JST [main] WARN  o.j.serializer.stax.StaxDirector - can not found deserialization handler : {http://jiemamy.org/xml/ns/diagram}diagrams
09:04:49.998 JST [main] WARN  o.j.serializer.stax.StaxDirector - can not found deserialization handler : {http://jiemamy.org/xml/ns/sql}sqls
09:04:49.998 JST [main] WARN  o.j.serializer.stax.StaxDirector - can not found deserialization handler : {http://jiemamy.org/xml/ns/diagram}diagrams
09:04:50.050 JST [main] WARN  o.j.serializer.stax.StaxDirector - can not found deserialization handler : {http://jiemamy.org/xml/ns/sql}sqls
09:04:50.051 JST [main] WARN  o.j.serializer.stax.StaxDirector - can not found deserialization handler : {http://jiemamy.org/xml/ns/diagram}diagrams
09:04:50.100 JST [main] WARN  o.j.serializer.stax.StaxDirector - can not found deserialization handler : {http://jiemamy.org/xml/ns/sql}sqls
09:04:50.101 JST [main] WARN  o.j.serializer.stax.StaxDirector - can not found deserialization handler : {http://jiemamy.org/xml/ns/diagram}diagrams
09:04:50.181 JST [main] WARN  o.j.serializer.stax.StaxDirector - can not found deserialization handler : {http://jiemamy.org/xml/ns/sql}sqls
09:04:50.182 JST [main] WARN  o.j.serializer.stax.StaxDirector - can not found deserialization handler : {http://jiemamy.org/xml/ns/diagram}diagrams
09:04:50.229 JST [main] WARN  o.j.serializer.stax.StaxDirector - can not found deserialization handler : {http://jiemamy.org/xml/ns/sql}sqls
09:04:50.229 JST [main] WARN  o.j.serializer.stax.StaxDirector - can not found deserialization handler : {http://jiemamy.org/xml/ns/diagram}diagrams
09:04:50.267 JST [main] WARN  o.j.serializer.stax.StaxDirector - can not found deserialization handler : {http://jiemamy.org/xml/ns/sql}sqls
09:04:50.268 JST [main] WARN  o.j.serializer.stax.StaxDirector - can not found deserialization handler : {http://jiemamy.org/xml/ns/diagram}diagrams
09:04:50.354 JST [main] WARN  o.j.serializer.stax.StaxDirector - can not found deserialization handler : {http://jiemamy.org/xml/ns/sql}sqls
09:04:50.355 JST [main] WARN  o.j.serializer.stax.StaxDirector - can not found deserialization handler : {http://jiemamy.org/xml/ns/diagram}diagrams
09:04:50.394 JST [main] WARN  o.j.serializer.stax.StaxDirector - can not found deserialization handler : {http://jiemamy.org/xml/ns/sql}sqls
09:04:50.395 JST [main] WARN  o.j.serializer.stax.StaxDirector - can not found deserialization handler : {http://jiemamy.org/xml/ns/diagram}diagrams
Tests run: 2, Failures: 0, Errors: 0, Skipped: 0, Time elapsed: 2.418 sec

Results :

Tests run: 2, Failures: 0, Errors: 0, Skipped: 0

[INFO] [jar:jar]
[INFO] Building jar: /home/services/jenkins/jobs/maven-codegen-plugin/workspace/maven-codegen-plugin/target/maven-codegen-plugin-0.4.2.1-SNAPSHOT.jar
[INFO] [plugin:addPluginArtifactMetadata]
[INFO] [install:install]
[INFO] Installing /home/services/jenkins/jobs/maven-codegen-plugin/workspace/maven-codegen-plugin/target/maven-codegen-plugin-0.4.2.1-SNAPSHOT.jar to /home/services/jenkins/.m2/repository/org/seasar/dao-codegen/maven-codegen-plugin/0.4.2.1-SNAPSHOT/maven-codegen-plugin-0.4.2.1-SNAPSHOT.jar
[INFO] [plugin:updateRegistry]
[INFO] ------------------------------------------------------------------------
[INFO] BUILD SUCCESSFUL
[INFO] ------------------------------------------------------------------------
[INFO] Total time: 10 seconds
[INFO] Finished at: Thu Nov 04 09:04:50 JST 2021
[INFO] Final Memory: 39M/407M
[INFO] ------------------------------------------------------------------------
[maven-codegen-plugin] $ /home/services/jenkins/tools/hudson.tasks.Maven_MavenInstallation/MAVEN-2.0/bin/mvn -f src/test/resources/pom.xml jiemamy:clean jiemamy:jiemamy org.codehaus.mojo:sql-maven-plugin:execute codegen:generate
[INFO] Scanning for projects...
[INFO] Searching repository for plugin with prefix: 'jiemamy'.
[INFO] org.apache.maven.plugins: checking for updates from maven.jiemamy.org
[WARNING] repository metadata for: 'org.apache.maven.plugins' could not be retrieved from repository: maven.jiemamy.org due to an error: Error transferring file
[INFO] Repository 'maven.jiemamy.org' will be blacklisted
[INFO] snapshot org.seasar.dao-codegen:maven-codegen-plugin:0.4.2.1-SNAPSHOT: checking for updates from maven.seasar.org
[INFO] snapshot org.seasar.dao-codegen:maven-codegen-plugin:0.4.2.1-SNAPSHOT: checking for updates from maven.snapshot.seasar.org
[WARNING] *** CHECKSUM FAILED - Checksum failed on download: local = '886df93760bec1f68a6ea1fc1db87d771f433b6b'; remote = '82ddb17742b24cb3a3a0709c8f095679f4cd5208' - RETRYING
[WARNING] *** CHECKSUM FAILED - Checksum failed on download: local = '886df93760bec1f68a6ea1fc1db87d771f433b6b'; remote = '82ddb17742b24cb3a3a0709c8f095679f4cd5208' - IGNORING
[INFO] ------------------------------------------------------------------------
[INFO] Building maven-codegen-plugin Maven Mojo
[INFO]    task-segment: [jiemamy:clean, jiemamy:jiemamy, org.codehaus.mojo:sql-maven-plugin:execute, codegen:generate]
[INFO] ------------------------------------------------------------------------
[INFO] [jiemamy:clean]
09:04:53.644 [main] DEBUG o.j.utils.enhancer.FactoryEnhancer - factoryInterface=interface org.jiemamy.JiemamyFactory
09:04:53.646 [main] DEBUG o.j.utils.enhancer.FactoryEnhancer - factoryImplementation=class org.jiemamy.internal.ArtemisJiemamyFactory
09:04:53.647 [main] DEBUG o.j.utils.enhancer.FactoryEnhancer - enhanceList=[]
09:04:53.654 [main] DEBUG o.j.utils.enhancer.FactoryEnhancer - Start factory enhancer: class org.jiemamy.internal.ArtemisJiemamyFactory
09:04:53.674 [main] DEBUG o.j.u.e.helper.EnhanceManipulator - Copy class: org.jiemamy.internal.ArtemisJiemamyFactory -> org.jiemamy.internal.ArtemisJiemamyFactory__ENHANCED__
09:04:53.678 [main] DEBUG o.j.u.e.h.AccessibilityValidator - Verifying accessibility: org.jiemamy.internal.ArtemisJiemamyFactory__ENHANCED__
09:04:53.739 [main] DEBUG o.j.u.e.helper.JavassistConverter - Register to JVM: org.jiemamy.internal.ArtemisJiemamyFactory__ENHANCED__
09:04:53.849 [main] INFO  org.jiemamy.utils.DatabaseCleaner - clean: jdbc:postgresql://localhost:5432/maven_codegen_plugin
09:04:53.850 [main] DEBUG o.j.utils.enhancer.FactoryEnhancer - factoryInterface=interface org.jiemamy.JiemamyFactory
09:04:53.850 [main] DEBUG o.j.utils.enhancer.FactoryEnhancer - factoryImplementation=class org.jiemamy.internal.ArtemisJiemamyFactory
09:04:53.850 [main] DEBUG o.j.utils.enhancer.FactoryEnhancer - enhanceList=[]
09:04:53.850 [main] DEBUG o.j.utils.enhancer.FactoryEnhancer - Start factory enhancer: class org.jiemamy.internal.ArtemisJiemamyFactory
09:04:53.859 [main] DEBUG o.j.u.e.helper.EnhanceManipulator - Copy class: org.jiemamy.internal.ArtemisJiemamyFactory -> org.jiemamy.internal.ArtemisJiemamyFactory__ENHANCED__
09:04:53.859 [main] DEBUG o.j.u.e.h.AccessibilityValidator - Verifying accessibility: org.jiemamy.internal.ArtemisJiemamyFactory__ENHANCED__
09:04:53.908 [main] DEBUG o.j.u.e.helper.JavassistConverter - Register to JVM: org.jiemamy.internal.ArtemisJiemamyFactory__ENHANCED__
09:04:54.050 [main] DEBUG o.j.d.i.i.DefaultEntityImportVisitor - type = TABLE(dept_table)
09:04:54.081 [main] DEBUG o.j.d.i.i.DefaultEntityImportVisitor -   dept_id = int4
09:04:54.085 [main] DEBUG o.j.d.i.i.DefaultEntityImportVisitor -   dname = varchar(14)
09:04:54.085 [main] DEBUG o.j.d.i.i.DefaultEntityImportVisitor -   loc = varchar(13)
09:04:54.086 [main] DEBUG o.j.d.i.i.DefaultEntityImportVisitor -   versionno = numeric(8, 0)
09:04:54.086 [main] DEBUG o.j.d.i.i.DefaultEntityImportVisitor -   active = numeric(1, 0)
09:04:56.388 [main] INFO  org.jiemamy.utils.SqlExecuter - DROP TABLE dept_table;
[INFO] [jiemamy:jiemamy]
[INFO] >>>> Starting maven-jiemamy-plugin...
[INFO] Open Jiemamy model file codegen.jer
[INFO] Serializing stream to model.
09:04:56.421 [main] DEBUG o.j.utils.enhancer.FactoryEnhancer - factoryInterface=interface org.jiemamy.JiemamyFactory
09:04:56.421 [main] DEBUG o.j.utils.enhancer.FactoryEnhancer - factoryImplementation=class org.jiemamy.internal.ArtemisJiemamyFactory
09:04:56.421 [main] DEBUG o.j.utils.enhancer.FactoryEnhancer - enhanceList=[]
09:04:56.421 [main] DEBUG o.j.utils.enhancer.FactoryEnhancer - Start factory enhancer: class org.jiemamy.internal.ArtemisJiemamyFactory
09:04:56.422 [main] DEBUG o.j.u.e.helper.EnhanceManipulator - Copy class: org.jiemamy.internal.ArtemisJiemamyFactory -> org.jiemamy.internal.ArtemisJiemamyFactory__ENHANCED__
09:04:56.422 [main] DEBUG o.j.u.e.h.AccessibilityValidator - Verifying accessibility: org.jiemamy.internal.ArtemisJiemamyFactory__ENHANCED__
09:04:56.440 [main] DEBUG o.j.u.e.helper.JavassistConverter - Register to JVM: org.jiemamy.internal.ArtemisJiemamyFactory__ENHANCED__
09:04:56.445 [main] DEBUG o.j.i.s.JiemamyDomSerializer - deserialize
[INFO] Configure Exporter...
[INFO] Executing Exporter...
[INFO] done.
[INFO] <<<< Exit maven-jiemamy-plugin successfully.
[INFO] [sql:execute]
[INFO] Executing file: /tmp/codegen.414445416sql
[ERROR] Failed to execute:  CREATE TABLE EMP_TABLE(EMP_NO NUMERIC(4)NOT NULL, PRIMARY KEY(EMP_NO), ENAME VARCHAR(10), JOB VARCHAR(9), MGR NUMERIC(4), HIRE_DATE DATE, SAL NUMERIC(7, 2), COMM NUMERIC(7, 2), DEPT_NO NUMERIC(2), TSTAMP TIMESTAMP, VERSIONNO NUMERIC(8)NOT NULL, FOREIGN KEY(DEPT_NO)REFERENCES DEPT_TABLE(DEPT_ID))
[INFO] ------------------------------------------------------------------------
[ERROR] BUILD ERROR
[INFO] ------------------------------------------------------------------------
[INFO] ERROR: foreign key constraint "emp_table_dept_no_fkey" cannot be implemented
  Detail: Key columns "dept_no" and "dept_id" are of incompatible types: numeric and integer.

[INFO] ------------------------------------------------------------------------
[INFO] For more information, run Maven with the -e switch
[INFO] ------------------------------------------------------------------------
[INFO] Total time: 5 seconds
[INFO] Finished at: Thu Nov 04 09:04:57 JST 2021
[INFO] Final Memory: 23M/414M
[INFO] ------------------------------------------------------------------------
Build step 'Mavenの呼び出し' marked build as failure
Sending e-mails to: azusa@fieldnotes.jp
Started calculate disk usage of build
Finished Calculation of disk usage of build in 0 seconds
Started calculate disk usage of workspace
Finished Calculation of disk usage of workspace in 0 seconds
Finished: FAILURE