Console Output

SCMのポーリングが実行
Updating https://www.seasar.org/svn/cubby/branches/1.1.x/cubby-project
D         cubby-skin
AU        LICENSE.txt
U         cubby/src/main/java/org/seasar/cubby/validator/DefaultValidationRules.java
U         cubby/src/site/site.xml
D         cubby-dist/site
A         cubby-dist/src
A         cubby-dist/src/site
AU        cubby-dist/src/site/site.xml
U         cubby-dist/build.xml
U         cubby-archetype/src/site/site.xml
D         src/site/xdoc
D         src/site/fml
U         src/site/site.xml
D         src/site/apt/download.apt
U         src/site/apt/setup.apt
U         src/site/apt/index.apt
D         src/site/resources/download
D         src/site/resources/eclipse-code-templates
D         src/site/resources/archetype-catalog.xml
D         src/site/resources/presentation
U         cubby-admin/src/site/site.xml
U         pom.xml
U         cubby-tomcat55-support/src/site/site.xml
At revision 1517
Parsing POMs
[cubby-project] $ /usr/local/java/jdk-1.5/bin/java -cp /home/services/apache/tomcat/webapps.d/localhost/webapps/hudson/WEB-INF/lib/maven-agent-1.295.jar:/usr/local/java/maven/boot/classworlds-1.1.jar hudson.maven.agent.Main /usr/local/java/maven /home/services/apache/tomcat/webapps.d/localhost/webapps/hudson/WEB-INF/lib/remoting-1.295.jar /home/services/apache/tomcat/webapps.d/localhost/webapps/hudson/WEB-INF/lib/maven-interceptor-1.295.jar 58311
channel started
Executing Maven:  -B -B -f /home/services/hudson/jobs/Cubby-1.1.x/workspace/cubby-project/pom.xml clean install
[INFO] Scanning for projects...
[INFO] ------------------------------------------------------------------------
[ERROR] BUILD FAILURE
[INFO] ------------------------------------------------------------------------
[INFO] Unable to build project '/home/services/hudson/jobs/Cubby-1.1.x/workspace/cubby-project/pom.xml; it requires Maven version 2.1.0
[INFO] ------------------------------------------------------------------------
[INFO] For more information, run Maven with the -e switch
[INFO] ------------------------------------------------------------------------
[INFO] Total time: < 1 second
[INFO] Finished at: Fri Apr 17 00:00:50 JST 2009
[INFO] Final Memory: 3M/38M
[INFO] ------------------------------------------------------------------------
channel stopped
Finished: FAILURE