SuccessConsole Output

[INFO]                                                                         
[INFO] ------------------------------------------------------------------------
[INFO] Building Teeda JSP Test (STATE_SAVING_METHOD=server) 1.0.13-sp11
[INFO] ------------------------------------------------------------------------
[INFO] 
[INFO] --- maven-clean-plugin:2.5:clean (default-clean) @ teeda-jsp-test ---
[INFO] Deleting /home/services/jenkins/jobs/teeda-1.0.13-it-snapshot/workspace/teeda-integration-test/teeda-jsp-test/target
[TASKS] Scanning folder '/home/services/jenkins/jobs/teeda-1.0.13-it-snapshot/workspace/teeda-integration-test/teeda-jsp-test' for files matching the pattern '**/*.java' - excludes: 
[TASKS] Found 3 files to scan for tasks
Found 0 open tasks.
[TASKS] ファイルのエンコーディングがpom.xmlで指定されていません。プラットフォームのエンコーディング(UTF-8)を使用します。すなわち、ビルドはプラットフォーム依存となります(<a href="http://docs.codehaus.org/display/MAVENUSER/POM+Element+for+Source+File+Encoding">Maven FAQ</a> 参照)。
java.io.IOException: Remote call on channel failed
	at hudson.remoting.Channel.call(Channel.java:748)
	at hudson.remoting.RemoteInvocationHandler.invoke(RemoteInvocationHandler.java:168)
	at com.sun.proxy.$Proxy7.execute(Unknown Source)
	at hudson.maven.MavenBuildProxy$Filter.execute(MavenBuildProxy.java:206)
	at hudson.plugins.analysis.core.HealthAwareReporter.registerResultsOnMaster(HealthAwareReporter.java:326)
	at hudson.plugins.analysis.core.HealthAwareReporter.postExecute(HealthAwareReporter.java:317)
	at hudson.maven.Maven3Builder$MavenExecutionListener.recordMojoEnded(Maven3Builder.java:628)
	at hudson.maven.Maven3Builder$MavenExecutionListener.mojoSucceeded(Maven3Builder.java:610)
	at hudson.maven.Maven3Builder$JenkinsEventSpy.onEvent(Maven3Builder.java:306)
	at org.apache.maven.eventspy.internal.EventSpyDispatcher.onEvent(EventSpyDispatcher.java:108)
	at org.apache.maven.eventspy.internal.EventSpyExecutionListener.mojoSucceeded(EventSpyExecutionListener.java:131)
	at org.apache.maven.lifecycle.internal.DefaultExecutionEventCatapult.fire(DefaultExecutionEventCatapult.java:87)
	at org.apache.maven.lifecycle.internal.DefaultExecutionEventCatapult.fire(DefaultExecutionEventCatapult.java:42)
	at org.apache.maven.lifecycle.internal.MojoExecutor.execute(MojoExecutor.java:227)
	at org.apache.maven.lifecycle.internal.MojoExecutor.execute(MojoExecutor.java:153)
	at org.apache.maven.lifecycle.internal.MojoExecutor.execute(MojoExecutor.java:145)
	at org.apache.maven.lifecycle.internal.LifecycleModuleBuilder.buildProject(LifecycleModuleBuilder.java:108)
	at org.apache.maven.lifecycle.internal.LifecycleModuleBuilder.buildProject(LifecycleModuleBuilder.java:76)
	at org.apache.maven.lifecycle.internal.builder.singlethreaded.SingleThreadedBuilder.build(SingleThreadedBuilder.java:51)
	at org.apache.maven.lifecycle.internal.LifecycleStarter.execute(LifecycleStarter.java:116)
	at org.apache.maven.DefaultMaven.doExecute(DefaultMaven.java:361)
	at org.apache.maven.DefaultMaven.execute(DefaultMaven.java:155)
	at org.jvnet.hudson.maven3.launcher.Maven31Launcher.main(Maven31Launcher.java:132)
	at sun.reflect.NativeMethodAccessorImpl.invoke0(Native Method)
	at sun.reflect.NativeMethodAccessorImpl.invoke(NativeMethodAccessorImpl.java:57)
	at sun.reflect.DelegatingMethodAccessorImpl.invoke(DelegatingMethodAccessorImpl.java:43)
	at java.lang.reflect.Method.invoke(Method.java:606)
	at org.codehaus.plexus.classworlds.launcher.Launcher.launchStandard(Launcher.java:330)
	at org.codehaus.plexus.classworlds.launcher.Launcher.launch(Launcher.java:238)
	at jenkins.maven3.agent.Maven31Main.launch(Maven31Main.java:181)
	at sun.reflect.NativeMethodAccessorImpl.invoke0(Native Method)
	at sun.reflect.NativeMethodAccessorImpl.invoke(NativeMethodAccessorImpl.java:57)
	at sun.reflect.DelegatingMethodAccessorImpl.invoke(DelegatingMethodAccessorImpl.java:43)
	at java.lang.reflect.Method.invoke(Method.java:606)
	at hudson.maven.Maven3Builder.call(Maven3Builder.java:134)
	at hudson.maven.Maven3Builder.call(Maven3Builder.java:69)
	at hudson.remoting.UserRequest.perform(UserRequest.java:118)
	at hudson.remoting.UserRequest.perform(UserRequest.java:48)
	at hudson.remoting.Request$2.run(Request.java:328)
	at hudson.remoting.InterceptingExecutorService$1.call(InterceptingExecutorService.java:72)
	at java.util.concurrent.FutureTask.run(FutureTask.java:262)
	at java.util.concurrent.ThreadPoolExecutor.runWorker(ThreadPoolExecutor.java:1145)
	at java.util.concurrent.ThreadPoolExecutor$Worker.run(ThreadPoolExecutor.java:615)
	at java.lang.Thread.run(Thread.java:745)
Caused by: java.lang.LinkageError: Failed to load com.google.common.collect.AbstractMapBasedMultimap
	at hudson.remoting.RemoteClassLoader.loadClassFile(RemoteClassLoader.java:326)
	at hudson.remoting.RemoteClassLoader.findClass(RemoteClassLoader.java:236)
	at java.lang.ClassLoader.loadClass(ClassLoader.java:425)
	at java.lang.ClassLoader.loadClass(ClassLoader.java:358)
	at java.lang.Class.forName0(Native Method)
	at java.lang.Class.forName(Class.java:270)
	at hudson.remoting.MultiClassLoaderSerializer$Input.resolveClass(MultiClassLoaderSerializer.java:113)
	at java.io.ObjectInputStream.readNonProxyDesc(ObjectInputStream.java:1612)
	at java.io.ObjectInputStream.readClassDesc(ObjectInputStream.java:1517)
	at java.io.ObjectInputStream.readNonProxyDesc(ObjectInputStream.java:1622)
	at java.io.ObjectInputStream.readClassDesc(ObjectInputStream.java:1517)
	at java.io.ObjectInputStream.readNonProxyDesc(ObjectInputStream.java:1622)
	at java.io.ObjectInputStream.readClassDesc(ObjectInputStream.java:1517)
	at java.io.ObjectInputStream.readOrdinaryObject(ObjectInputStream.java:1771)
	at java.io.ObjectInputStream.readObject0(ObjectInputStream.java:1350)
	at java.io.ObjectInputStream.defaultReadFields(ObjectInputStream.java:1990)
	at java.io.ObjectInputStream.readSerialData(ObjectInputStream.java:1915)
	at java.io.ObjectInputStream.readOrdinaryObject(ObjectInputStream.java:1798)
	at java.io.ObjectInputStream.readObject0(ObjectInputStream.java:1350)
	at java.io.ObjectInputStream.defaultReadFields(ObjectInputStream.java:1990)
	at java.io.ObjectInputStream.readSerialData(ObjectInputStream.java:1915)
	at java.io.ObjectInputStream.readOrdinaryObject(ObjectInputStream.java:1798)
	at java.io.ObjectInputStream.readObject0(ObjectInputStream.java:1350)
	at java.io.ObjectInputStream.readArray(ObjectInputStream.java:1706)
	at java.io.ObjectInputStream.readObject0(ObjectInputStream.java:1344)
	at java.io.ObjectInputStream.defaultReadFields(ObjectInputStream.java:1990)
	at java.io.ObjectInputStream.readSerialData(ObjectInputStream.java:1915)
	at java.io.ObjectInputStream.readOrdinaryObject(ObjectInputStream.java:1798)
	at java.io.ObjectInputStream.readObject0(ObjectInputStream.java:1350)
	at java.io.ObjectInputStream.readObject(ObjectInputStream.java:370)
	at hudson.remoting.UserRequest.deserialize(UserRequest.java:182)
	at hudson.remoting.UserRequest.perform(UserRequest.java:98)
	at hudson.remoting.UserRequest.perform(UserRequest.java:48)
	at hudson.remoting.Request$2.run(Request.java:328)
	at hudson.remoting.InterceptingExecutorService$1.call(InterceptingExecutorService.java:72)
	at jenkins.util.ContextResettingExecutorService$2.call(ContextResettingExecutorService.java:46)
	... 4 more
Caused by: java.lang.IllegalAccessError: class com.google.common.collect.AbstractMapBasedMultimap cannot access its superclass com.google.common.collect.AbstractMultimap
	at java.lang.ClassLoader.defineClass1(Native Method)
	at java.lang.ClassLoader.defineClass(ClassLoader.java:800)
	at java.lang.ClassLoader.defineClass(ClassLoader.java:643)
	at hudson.remoting.RemoteClassLoader.loadClassFile(RemoteClassLoader.java:322)
	... 39 more
[INFO] 
[INFO] --- cobertura-maven-plugin:2.2:clean (default) @ teeda-jsp-test ---
[TASKS] Scanning folder '/home/services/jenkins/jobs/teeda-1.0.13-it-snapshot/workspace/teeda-integration-test/teeda-jsp-test' for files matching the pattern '**/*.java' - excludes: 
[TASKS] Found 3 files to scan for tasks
Found 0 open tasks.
[TASKS] ファイルのエンコーディングがpom.xmlで指定されていません。プラットフォームのエンコーディング(UTF-8)を使用します。すなわち、ビルドはプラットフォーム依存となります(<a href="http://docs.codehaus.org/display/MAVENUSER/POM+Element+for+Source+File+Encoding">Maven FAQ</a> 参照)。
java.io.IOException: Remote call on channel failed
	at hudson.remoting.Channel.call(Channel.java:748)
	at hudson.remoting.RemoteInvocationHandler.invoke(RemoteInvocationHandler.java:168)
	at com.sun.proxy.$Proxy7.execute(Unknown Source)
	at hudson.maven.MavenBuildProxy$Filter.execute(MavenBuildProxy.java:206)
	at hudson.plugins.analysis.core.HealthAwareReporter.registerResultsOnMaster(HealthAwareReporter.java:326)
	at hudson.plugins.analysis.core.HealthAwareReporter.postExecute(HealthAwareReporter.java:317)
	at hudson.maven.Maven3Builder$MavenExecutionListener.recordMojoEnded(Maven3Builder.java:628)
	at hudson.maven.Maven3Builder$MavenExecutionListener.mojoSucceeded(Maven3Builder.java:610)
	at hudson.maven.Maven3Builder$JenkinsEventSpy.onEvent(Maven3Builder.java:306)
	at org.apache.maven.eventspy.internal.EventSpyDispatcher.onEvent(EventSpyDispatcher.java:108)
	at org.apache.maven.eventspy.internal.EventSpyExecutionListener.mojoSucceeded(EventSpyExecutionListener.java:131)
	at org.apache.maven.lifecycle.internal.DefaultExecutionEventCatapult.fire(DefaultExecutionEventCatapult.java:87)
	at org.apache.maven.lifecycle.internal.DefaultExecutionEventCatapult.fire(DefaultExecutionEventCatapult.java:42)
	at org.apache.maven.lifecycle.internal.MojoExecutor.execute(MojoExecutor.java:227)
	at org.apache.maven.lifecycle.internal.MojoExecutor.execute(MojoExecutor.java:153)
	at org.apache.maven.lifecycle.internal.MojoExecutor.execute(MojoExecutor.java:145)
	at org.apache.maven.lifecycle.internal.LifecycleModuleBuilder.buildProject(LifecycleModuleBuilder.java:108)
	at org.apache.maven.lifecycle.internal.LifecycleModuleBuilder.buildProject(LifecycleModuleBuilder.java:76)
	at org.apache.maven.lifecycle.internal.builder.singlethreaded.SingleThreadedBuilder.build(SingleThreadedBuilder.java:51)
	at org.apache.maven.lifecycle.internal.LifecycleStarter.execute(LifecycleStarter.java:116)
	at org.apache.maven.DefaultMaven.doExecute(DefaultMaven.java:361)
	at org.apache.maven.DefaultMaven.execute(DefaultMaven.java:155)
	at org.jvnet.hudson.maven3.launcher.Maven31Launcher.main(Maven31Launcher.java:132)
	at sun.reflect.NativeMethodAccessorImpl.invoke0(Native Method)
	at sun.reflect.NativeMethodAccessorImpl.invoke(NativeMethodAccessorImpl.java:57)
	at sun.reflect.DelegatingMethodAccessorImpl.invoke(DelegatingMethodAccessorImpl.java:43)
	at java.lang.reflect.Method.invoke(Method.java:606)
	at org.codehaus.plexus.classworlds.launcher.Launcher.launchStandard(Launcher.java:330)
	at org.codehaus.plexus.classworlds.launcher.Launcher.launch(Launcher.java:238)
	at jenkins.maven3.agent.Maven31Main.launch(Maven31Main.java:181)
	at sun.reflect.NativeMethodAccessorImpl.invoke0(Native Method)
	at sun.reflect.NativeMethodAccessorImpl.invoke(NativeMethodAccessorImpl.java:57)
	at sun.reflect.DelegatingMethodAccessorImpl.invoke(DelegatingMethodAccessorImpl.java:43)
	at java.lang.reflect.Method.invoke(Method.java:606)
	at hudson.maven.Maven3Builder.call(Maven3Builder.java:134)
	at hudson.maven.Maven3Builder.call(Maven3Builder.java:69)
	at hudson.remoting.UserRequest.perform(UserRequest.java:118)
	at hudson.remoting.UserRequest.perform(UserRequest.java:48)
	at hudson.remoting.Request$2.run(Request.java:328)
	at hudson.remoting.InterceptingExecutorService$1.call(InterceptingExecutorService.java:72)
	at java.util.concurrent.FutureTask.run(FutureTask.java:262)
	at java.util.concurrent.ThreadPoolExecutor.runWorker(ThreadPoolExecutor.java:1145)
	at java.util.concurrent.ThreadPoolExecutor$Worker.run(ThreadPoolExecutor.java:615)
	at java.lang.Thread.run(Thread.java:745)
Caused by: java.lang.LinkageError: Failed to load com.google.common.collect.AbstractMapBasedMultimap
	at hudson.remoting.RemoteClassLoader.loadClassFile(RemoteClassLoader.java:326)
	at hudson.remoting.RemoteClassLoader.findClass(RemoteClassLoader.java:236)
	at java.lang.ClassLoader.loadClass(ClassLoader.java:425)
	at java.lang.ClassLoader.loadClass(ClassLoader.java:358)
	at java.lang.Class.forName0(Native Method)
	at java.lang.Class.forName(Class.java:270)
	at hudson.remoting.MultiClassLoaderSerializer$Input.resolveClass(MultiClassLoaderSerializer.java:113)
	at java.io.ObjectInputStream.readNonProxyDesc(ObjectInputStream.java:1612)
	at java.io.ObjectInputStream.readClassDesc(ObjectInputStream.java:1517)
	at java.io.ObjectInputStream.readNonProxyDesc(ObjectInputStream.java:1622)
	at java.io.ObjectInputStream.readClassDesc(ObjectInputStream.java:1517)
	at java.io.ObjectInputStream.readNonProxyDesc(ObjectInputStream.java:1622)
	at java.io.ObjectInputStream.readClassDesc(ObjectInputStream.java:1517)
	at java.io.ObjectInputStream.readOrdinaryObject(ObjectInputStream.java:1771)
	at java.io.ObjectInputStream.readObject0(ObjectInputStream.java:1350)
	at java.io.ObjectInputStream.defaultReadFields(ObjectInputStream.java:1990)
	at java.io.ObjectInputStream.readSerialData(ObjectInputStream.java:1915)
	at java.io.ObjectInputStream.readOrdinaryObject(ObjectInputStream.java:1798)
	at java.io.ObjectInputStream.readObject0(ObjectInputStream.java:1350)
	at java.io.ObjectInputStream.defaultReadFields(ObjectInputStream.java:1990)
	at java.io.ObjectInputStream.readSerialData(ObjectInputStream.java:1915)
	at java.io.ObjectInputStream.readOrdinaryObject(ObjectInputStream.java:1798)
	at java.io.ObjectInputStream.readObject0(ObjectInputStream.java:1350)
	at java.io.ObjectInputStream.readArray(ObjectInputStream.java:1706)
	at java.io.ObjectInputStream.readObject0(ObjectInputStream.java:1344)
	at java.io.ObjectInputStream.defaultReadFields(ObjectInputStream.java:1990)
	at java.io.ObjectInputStream.readSerialData(ObjectInputStream.java:1915)
	at java.io.ObjectInputStream.readOrdinaryObject(ObjectInputStream.java:1798)
	at java.io.ObjectInputStream.readObject0(ObjectInputStream.java:1350)
	at java.io.ObjectInputStream.readObject(ObjectInputStream.java:370)
	at hudson.remoting.UserRequest.deserialize(UserRequest.java:182)
	at hudson.remoting.UserRequest.perform(UserRequest.java:98)
	at hudson.remoting.UserRequest.perform(UserRequest.java:48)
	at hudson.remoting.Request$2.run(Request.java:328)
	at hudson.remoting.InterceptingExecutorService$1.call(InterceptingExecutorService.java:72)
	at jenkins.util.ContextResettingExecutorService$2.call(ContextResettingExecutorService.java:46)
	... 4 more
Caused by: java.lang.IllegalAccessError: class com.google.common.collect.AbstractMapBasedMultimap cannot access its superclass com.google.common.collect.AbstractMultimap
	at java.lang.ClassLoader.defineClass1(Native Method)
	at java.lang.ClassLoader.defineClass(ClassLoader.java:800)
	at java.lang.ClassLoader.defineClass(ClassLoader.java:643)
	at hudson.remoting.RemoteClassLoader.loadClassFile(RemoteClassLoader.java:322)
	... 39 more
[INFO] 
[INFO] --- maven-resources-plugin:2.6:resources (default-resources) @ teeda-jsp-test ---
[WARNING] Using platform encoding (UTF-8 actually) to copy filtered resources, i.e. build is platform dependent!
[INFO] Copying 8 resources
[TASKS] Scanning folder '/home/services/jenkins/jobs/teeda-1.0.13-it-snapshot/workspace/teeda-integration-test/teeda-jsp-test' for files matching the pattern '**/*.java' - excludes: 
[TASKS] Found 3 files to scan for tasks
Found 0 open tasks.
[TASKS] ファイルのエンコーディングがpom.xmlで指定されていません。プラットフォームのエンコーディング(UTF-8)を使用します。すなわち、ビルドはプラットフォーム依存となります(<a href="http://docs.codehaus.org/display/MAVENUSER/POM+Element+for+Source+File+Encoding">Maven FAQ</a> 参照)。
java.io.IOException: Remote call on channel failed
	at hudson.remoting.Channel.call(Channel.java:748)
	at hudson.remoting.RemoteInvocationHandler.invoke(RemoteInvocationHandler.java:168)
	at com.sun.proxy.$Proxy7.execute(Unknown Source)
	at hudson.maven.MavenBuildProxy$Filter.execute(MavenBuildProxy.java:206)
	at hudson.plugins.analysis.core.HealthAwareReporter.registerResultsOnMaster(HealthAwareReporter.java:326)
	at hudson.plugins.analysis.core.HealthAwareReporter.postExecute(HealthAwareReporter.java:317)
	at hudson.maven.Maven3Builder$MavenExecutionListener.recordMojoEnded(Maven3Builder.java:628)
	at hudson.maven.Maven3Builder$MavenExecutionListener.mojoSucceeded(Maven3Builder.java:610)
	at hudson.maven.Maven3Builder$JenkinsEventSpy.onEvent(Maven3Builder.java:306)
	at org.apache.maven.eventspy.internal.EventSpyDispatcher.onEvent(EventSpyDispatcher.java:108)
	at org.apache.maven.eventspy.internal.EventSpyExecutionListener.mojoSucceeded(EventSpyExecutionListener.java:131)
	at org.apache.maven.lifecycle.internal.DefaultExecutionEventCatapult.fire(DefaultExecutionEventCatapult.java:87)
	at org.apache.maven.lifecycle.internal.DefaultExecutionEventCatapult.fire(DefaultExecutionEventCatapult.java:42)
	at org.apache.maven.lifecycle.internal.MojoExecutor.execute(MojoExecutor.java:227)
	at org.apache.maven.lifecycle.internal.MojoExecutor.execute(MojoExecutor.java:153)
	at org.apache.maven.lifecycle.internal.MojoExecutor.execute(MojoExecutor.java:145)
	at org.apache.maven.lifecycle.internal.LifecycleModuleBuilder.buildProject(LifecycleModuleBuilder.java:108)
	at org.apache.maven.lifecycle.internal.LifecycleModuleBuilder.buildProject(LifecycleModuleBuilder.java:76)
	at org.apache.maven.lifecycle.internal.builder.singlethreaded.SingleThreadedBuilder.build(SingleThreadedBuilder.java:51)
	at org.apache.maven.lifecycle.internal.LifecycleStarter.execute(LifecycleStarter.java:116)
	at org.apache.maven.DefaultMaven.doExecute(DefaultMaven.java:361)
	at org.apache.maven.DefaultMaven.execute(DefaultMaven.java:155)
	at org.jvnet.hudson.maven3.launcher.Maven31Launcher.main(Maven31Launcher.java:132)
	at sun.reflect.NativeMethodAccessorImpl.invoke0(Native Method)
	at sun.reflect.NativeMethodAccessorImpl.invoke(NativeMethodAccessorImpl.java:57)
	at sun.reflect.DelegatingMethodAccessorImpl.invoke(DelegatingMethodAccessorImpl.java:43)
	at java.lang.reflect.Method.invoke(Method.java:606)
	at org.codehaus.plexus.classworlds.launcher.Launcher.launchStandard(Launcher.java:330)
	at org.codehaus.plexus.classworlds.launcher.Launcher.launch(Launcher.java:238)
	at jenkins.maven3.agent.Maven31Main.launch(Maven31Main.java:181)
	at sun.reflect.NativeMethodAccessorImpl.invoke0(Native Method)
	at sun.reflect.NativeMethodAccessorImpl.invoke(NativeMethodAccessorImpl.java:57)
	at sun.reflect.DelegatingMethodAccessorImpl.invoke(DelegatingMethodAccessorImpl.java:43)
	at java.lang.reflect.Method.invoke(Method.java:606)
	at hudson.maven.Maven3Builder.call(Maven3Builder.java:134)
	at hudson.maven.Maven3Builder.call(Maven3Builder.java:69)
	at hudson.remoting.UserRequest.perform(UserRequest.java:118)
	at hudson.remoting.UserRequest.perform(UserRequest.java:48)
	at hudson.remoting.Request$2.run(Request.java:328)
	at hudson.remoting.InterceptingExecutorService$1.call(InterceptingExecutorService.java:72)
	at java.util.concurrent.FutureTask.run(FutureTask.java:262)
	at java.util.concurrent.ThreadPoolExecutor.runWorker(ThreadPoolExecutor.java:1145)
	at java.util.concurrent.ThreadPoolExecutor$Worker.run(ThreadPoolExecutor.java:615)
	at java.lang.Thread.run(Thread.java:745)
Caused by: java.lang.LinkageError: Failed to load com.google.common.collect.AbstractMapBasedMultimap
	at hudson.remoting.RemoteClassLoader.loadClassFile(RemoteClassLoader.java:326)
	at hudson.remoting.RemoteClassLoader.findClass(RemoteClassLoader.java:236)
	at java.lang.ClassLoader.loadClass(ClassLoader.java:425)
	at java.lang.ClassLoader.loadClass(ClassLoader.java:358)
	at java.lang.Class.forName0(Native Method)
	at java.lang.Class.forName(Class.java:270)
	at hudson.remoting.MultiClassLoaderSerializer$Input.resolveClass(MultiClassLoaderSerializer.java:113)
	at java.io.ObjectInputStream.readNonProxyDesc(ObjectInputStream.java:1612)
	at java.io.ObjectInputStream.readClassDesc(ObjectInputStream.java:1517)
	at java.io.ObjectInputStream.readNonProxyDesc(ObjectInputStream.java:1622)
	at java.io.ObjectInputStream.readClassDesc(ObjectInputStream.java:1517)
	at java.io.ObjectInputStream.readNonProxyDesc(ObjectInputStream.java:1622)
	at java.io.ObjectInputStream.readClassDesc(ObjectInputStream.java:1517)
	at java.io.ObjectInputStream.readOrdinaryObject(ObjectInputStream.java:1771)
	at java.io.ObjectInputStream.readObject0(ObjectInputStream.java:1350)
	at java.io.ObjectInputStream.defaultReadFields(ObjectInputStream.java:1990)
	at java.io.ObjectInputStream.readSerialData(ObjectInputStream.java:1915)
	at java.io.ObjectInputStream.readOrdinaryObject(ObjectInputStream.java:1798)
	at java.io.ObjectInputStream.readObject0(ObjectInputStream.java:1350)
	at java.io.ObjectInputStream.defaultReadFields(ObjectInputStream.java:1990)
	at java.io.ObjectInputStream.readSerialData(ObjectInputStream.java:1915)
	at java.io.ObjectInputStream.readOrdinaryObject(ObjectInputStream.java:1798)
	at java.io.ObjectInputStream.readObject0(ObjectInputStream.java:1350)
	at java.io.ObjectInputStream.readArray(ObjectInputStream.java:1706)
	at java.io.ObjectInputStream.readObject0(ObjectInputStream.java:1344)
	at java.io.ObjectInputStream.defaultReadFields(ObjectInputStream.java:1990)
	at java.io.ObjectInputStream.readSerialData(ObjectInputStream.java:1915)
	at java.io.ObjectInputStream.readOrdinaryObject(ObjectInputStream.java:1798)
	at java.io.ObjectInputStream.readObject0(ObjectInputStream.java:1350)
	at java.io.ObjectInputStream.readObject(ObjectInputStream.java:370)
	at hudson.remoting.UserRequest.deserialize(UserRequest.java:182)
	at hudson.remoting.UserRequest.perform(UserRequest.java:98)
	at hudson.remoting.UserRequest.perform(UserRequest.java:48)
	at hudson.remoting.Request$2.run(Request.java:328)
	at hudson.remoting.InterceptingExecutorService$1.call(InterceptingExecutorService.java:72)
	at jenkins.util.ContextResettingExecutorService$2.call(ContextResettingExecutorService.java:46)
	... 4 more
Caused by: java.lang.IllegalAccessError: class com.google.common.collect.AbstractMapBasedMultimap cannot access its superclass com.google.common.collect.AbstractMultimap
	at java.lang.ClassLoader.defineClass1(Native Method)
	at java.lang.ClassLoader.defineClass(ClassLoader.java:800)
	at java.lang.ClassLoader.defineClass(ClassLoader.java:643)
	at hudson.remoting.RemoteClassLoader.loadClassFile(RemoteClassLoader.java:322)
	... 39 more
[INFO] 
[INFO] --- maven-compiler-plugin:2.5.1:compile (default-compile) @ teeda-jsp-test ---
[INFO] Compiling 1 source file to /home/services/jenkins/jobs/teeda-1.0.13-it-snapshot/workspace/teeda-integration-test/teeda-jsp-test/target/classes
[TASKS] Scanning folder '/home/services/jenkins/jobs/teeda-1.0.13-it-snapshot/workspace/teeda-integration-test/teeda-jsp-test' for files matching the pattern '**/*.java' - excludes: 
[TASKS] Found 3 files to scan for tasks
Found 0 open tasks.
[TASKS] ファイルのエンコーディングがpom.xmlで指定されていません。プラットフォームのエンコーディング(UTF-8)を使用します。すなわち、ビルドはプラットフォーム依存となります(<a href="http://docs.codehaus.org/display/MAVENUSER/POM+Element+for+Source+File+Encoding">Maven FAQ</a> 参照)。
java.io.IOException: Remote call on channel failed
	at hudson.remoting.Channel.call(Channel.java:748)
	at hudson.remoting.RemoteInvocationHandler.invoke(RemoteInvocationHandler.java:168)
	at com.sun.proxy.$Proxy7.execute(Unknown Source)
	at hudson.maven.MavenBuildProxy$Filter.execute(MavenBuildProxy.java:206)
	at hudson.plugins.analysis.core.HealthAwareReporter.registerResultsOnMaster(HealthAwareReporter.java:326)
	at hudson.plugins.analysis.core.HealthAwareReporter.postExecute(HealthAwareReporter.java:317)
	at hudson.maven.Maven3Builder$MavenExecutionListener.recordMojoEnded(Maven3Builder.java:628)
	at hudson.maven.Maven3Builder$MavenExecutionListener.mojoSucceeded(Maven3Builder.java:610)
	at hudson.maven.Maven3Builder$JenkinsEventSpy.onEvent(Maven3Builder.java:306)
	at org.apache.maven.eventspy.internal.EventSpyDispatcher.onEvent(EventSpyDispatcher.java:108)
	at org.apache.maven.eventspy.internal.EventSpyExecutionListener.mojoSucceeded(EventSpyExecutionListener.java:131)
	at org.apache.maven.lifecycle.internal.DefaultExecutionEventCatapult.fire(DefaultExecutionEventCatapult.java:87)
	at org.apache.maven.lifecycle.internal.DefaultExecutionEventCatapult.fire(DefaultExecutionEventCatapult.java:42)
	at org.apache.maven.lifecycle.internal.MojoExecutor.execute(MojoExecutor.java:227)
	at org.apache.maven.lifecycle.internal.MojoExecutor.execute(MojoExecutor.java:153)
	at org.apache.maven.lifecycle.internal.MojoExecutor.execute(MojoExecutor.java:145)
	at org.apache.maven.lifecycle.internal.LifecycleModuleBuilder.buildProject(LifecycleModuleBuilder.java:108)
	at org.apache.maven.lifecycle.internal.LifecycleModuleBuilder.buildProject(LifecycleModuleBuilder.java:76)
	at org.apache.maven.lifecycle.internal.builder.singlethreaded.SingleThreadedBuilder.build(SingleThreadedBuilder.java:51)
	at org.apache.maven.lifecycle.internal.LifecycleStarter.execute(LifecycleStarter.java:116)
	at org.apache.maven.DefaultMaven.doExecute(DefaultMaven.java:361)
	at org.apache.maven.DefaultMaven.execute(DefaultMaven.java:155)
	at org.jvnet.hudson.maven3.launcher.Maven31Launcher.main(Maven31Launcher.java:132)
	at sun.reflect.NativeMethodAccessorImpl.invoke0(Native Method)
	at sun.reflect.NativeMethodAccessorImpl.invoke(NativeMethodAccessorImpl.java:57)
	at sun.reflect.DelegatingMethodAccessorImpl.invoke(DelegatingMethodAccessorImpl.java:43)
	at java.lang.reflect.Method.invoke(Method.java:606)
	at org.codehaus.plexus.classworlds.launcher.Launcher.launchStandard(Launcher.java:330)
	at org.codehaus.plexus.classworlds.launcher.Launcher.launch(Launcher.java:238)
	at jenkins.maven3.agent.Maven31Main.launch(Maven31Main.java:181)
	at sun.reflect.NativeMethodAccessorImpl.invoke0(Native Method)
	at sun.reflect.NativeMethodAccessorImpl.invoke(NativeMethodAccessorImpl.java:57)
	at sun.reflect.DelegatingMethodAccessorImpl.invoke(DelegatingMethodAccessorImpl.java:43)
	at java.lang.reflect.Method.invoke(Method.java:606)
	at hudson.maven.Maven3Builder.call(Maven3Builder.java:134)
	at hudson.maven.Maven3Builder.call(Maven3Builder.java:69)
	at hudson.remoting.UserRequest.perform(UserRequest.java:118)
	at hudson.remoting.UserRequest.perform(UserRequest.java:48)
	at hudson.remoting.Request$2.run(Request.java:328)
	at hudson.remoting.InterceptingExecutorService$1.call(InterceptingExecutorService.java:72)
	at java.util.concurrent.FutureTask.run(FutureTask.java:262)
	at java.util.concurrent.ThreadPoolExecutor.runWorker(ThreadPoolExecutor.java:1145)
	at java.util.concurrent.ThreadPoolExecutor$Worker.run(ThreadPoolExecutor.java:615)
	at java.lang.Thread.run(Thread.java:745)
Caused by: java.lang.LinkageError: Failed to load com.google.common.collect.AbstractMapBasedMultimap
	at hudson.remoting.RemoteClassLoader.loadClassFile(RemoteClassLoader.java:326)
	at hudson.remoting.RemoteClassLoader.findClass(RemoteClassLoader.java:236)
	at java.lang.ClassLoader.loadClass(ClassLoader.java:425)
	at java.lang.ClassLoader.loadClass(ClassLoader.java:358)
	at java.lang.Class.forName0(Native Method)
	at java.lang.Class.forName(Class.java:270)
	at hudson.remoting.MultiClassLoaderSerializer$Input.resolveClass(MultiClassLoaderSerializer.java:113)
	at java.io.ObjectInputStream.readNonProxyDesc(ObjectInputStream.java:1612)
	at java.io.ObjectInputStream.readClassDesc(ObjectInputStream.java:1517)
	at java.io.ObjectInputStream.readNonProxyDesc(ObjectInputStream.java:1622)
	at java.io.ObjectInputStream.readClassDesc(ObjectInputStream.java:1517)
	at java.io.ObjectInputStream.readNonProxyDesc(ObjectInputStream.java:1622)
	at java.io.ObjectInputStream.readClassDesc(ObjectInputStream.java:1517)
	at java.io.ObjectInputStream.readOrdinaryObject(ObjectInputStream.java:1771)
	at java.io.ObjectInputStream.readObject0(ObjectInputStream.java:1350)
	at java.io.ObjectInputStream.defaultReadFields(ObjectInputStream.java:1990)
	at java.io.ObjectInputStream.readSerialData(ObjectInputStream.java:1915)
	at java.io.ObjectInputStream.readOrdinaryObject(ObjectInputStream.java:1798)
	at java.io.ObjectInputStream.readObject0(ObjectInputStream.java:1350)
	at java.io.ObjectInputStream.defaultReadFields(ObjectInputStream.java:1990)
	at java.io.ObjectInputStream.readSerialData(ObjectInputStream.java:1915)
	at java.io.ObjectInputStream.readOrdinaryObject(ObjectInputStream.java:1798)
	at java.io.ObjectInputStream.readObject0(ObjectInputStream.java:1350)
	at java.io.ObjectInputStream.readArray(ObjectInputStream.java:1706)
	at java.io.ObjectInputStream.readObject0(ObjectInputStream.java:1344)
	at java.io.ObjectInputStream.defaultReadFields(ObjectInputStream.java:1990)
	at java.io.ObjectInputStream.readSerialData(ObjectInputStream.java:1915)
	at java.io.ObjectInputStream.readOrdinaryObject(ObjectInputStream.java:1798)
	at java.io.ObjectInputStream.readObject0(ObjectInputStream.java:1350)
	at java.io.ObjectInputStream.readObject(ObjectInputStream.java:370)
	at hudson.remoting.UserRequest.deserialize(UserRequest.java:182)
	at hudson.remoting.UserRequest.perform(UserRequest.java:98)
	at hudson.remoting.UserRequest.perform(UserRequest.java:48)
	at hudson.remoting.Request$2.run(Request.java:328)
	at hudson.remoting.InterceptingExecutorService$1.call(InterceptingExecutorService.java:72)
	at jenkins.util.ContextResettingExecutorService$2.call(ContextResettingExecutorService.java:46)
	... 4 more
Caused by: java.lang.IllegalAccessError: class com.google.common.collect.AbstractMapBasedMultimap cannot access its superclass com.google.common.collect.AbstractMultimap
	at java.lang.ClassLoader.defineClass1(Native Method)
	at java.lang.ClassLoader.defineClass(ClassLoader.java:800)
	at java.lang.ClassLoader.defineClass(ClassLoader.java:643)
	at hudson.remoting.RemoteClassLoader.loadClassFile(RemoteClassLoader.java:322)
	... 39 more
[INFO] 
[INFO] --- maven-resources-plugin:2.6:testResources (default-testResources) @ teeda-jsp-test ---
[WARNING] Using platform encoding (UTF-8 actually) to copy filtered resources, i.e. build is platform dependent!
[INFO] Copying 1 resource
[TASKS] Scanning folder '/home/services/jenkins/jobs/teeda-1.0.13-it-snapshot/workspace/teeda-integration-test/teeda-jsp-test' for files matching the pattern '**/*.java' - excludes: 
[TASKS] Found 3 files to scan for tasks
Found 0 open tasks.
[TASKS] ファイルのエンコーディングがpom.xmlで指定されていません。プラットフォームのエンコーディング(UTF-8)を使用します。すなわち、ビルドはプラットフォーム依存となります(<a href="http://docs.codehaus.org/display/MAVENUSER/POM+Element+for+Source+File+Encoding">Maven FAQ</a> 参照)。
java.io.IOException: Remote call on channel failed
	at hudson.remoting.Channel.call(Channel.java:748)
	at hudson.remoting.RemoteInvocationHandler.invoke(RemoteInvocationHandler.java:168)
	at com.sun.proxy.$Proxy7.execute(Unknown Source)
	at hudson.maven.MavenBuildProxy$Filter.execute(MavenBuildProxy.java:206)
	at hudson.plugins.analysis.core.HealthAwareReporter.registerResultsOnMaster(HealthAwareReporter.java:326)
	at hudson.plugins.analysis.core.HealthAwareReporter.postExecute(HealthAwareReporter.java:317)
	at hudson.maven.Maven3Builder$MavenExecutionListener.recordMojoEnded(Maven3Builder.java:628)
	at hudson.maven.Maven3Builder$MavenExecutionListener.mojoSucceeded(Maven3Builder.java:610)
	at hudson.maven.Maven3Builder$JenkinsEventSpy.onEvent(Maven3Builder.java:306)
	at org.apache.maven.eventspy.internal.EventSpyDispatcher.onEvent(EventSpyDispatcher.java:108)
	at org.apache.maven.eventspy.internal.EventSpyExecutionListener.mojoSucceeded(EventSpyExecutionListener.java:131)
	at org.apache.maven.lifecycle.internal.DefaultExecutionEventCatapult.fire(DefaultExecutionEventCatapult.java:87)
	at org.apache.maven.lifecycle.internal.DefaultExecutionEventCatapult.fire(DefaultExecutionEventCatapult.java:42)
	at org.apache.maven.lifecycle.internal.MojoExecutor.execute(MojoExecutor.java:227)
	at org.apache.maven.lifecycle.internal.MojoExecutor.execute(MojoExecutor.java:153)
	at org.apache.maven.lifecycle.internal.MojoExecutor.execute(MojoExecutor.java:145)
	at org.apache.maven.lifecycle.internal.LifecycleModuleBuilder.buildProject(LifecycleModuleBuilder.java:108)
	at org.apache.maven.lifecycle.internal.LifecycleModuleBuilder.buildProject(LifecycleModuleBuilder.java:76)
	at org.apache.maven.lifecycle.internal.builder.singlethreaded.SingleThreadedBuilder.build(SingleThreadedBuilder.java:51)
	at org.apache.maven.lifecycle.internal.LifecycleStarter.execute(LifecycleStarter.java:116)
	at org.apache.maven.DefaultMaven.doExecute(DefaultMaven.java:361)
	at org.apache.maven.DefaultMaven.execute(DefaultMaven.java:155)
	at org.jvnet.hudson.maven3.launcher.Maven31Launcher.main(Maven31Launcher.java:132)
	at sun.reflect.NativeMethodAccessorImpl.invoke0(Native Method)
	at sun.reflect.NativeMethodAccessorImpl.invoke(NativeMethodAccessorImpl.java:57)
	at sun.reflect.DelegatingMethodAccessorImpl.invoke(DelegatingMethodAccessorImpl.java:43)
	at java.lang.reflect.Method.invoke(Method.java:606)
	at org.codehaus.plexus.classworlds.launcher.Launcher.launchStandard(Launcher.java:330)
	at org.codehaus.plexus.classworlds.launcher.Launcher.launch(Launcher.java:238)
	at jenkins.maven3.agent.Maven31Main.launch(Maven31Main.java:181)
	at sun.reflect.NativeMethodAccessorImpl.invoke0(Native Method)
	at sun.reflect.NativeMethodAccessorImpl.invoke(NativeMethodAccessorImpl.java:57)
	at sun.reflect.DelegatingMethodAccessorImpl.invoke(DelegatingMethodAccessorImpl.java:43)
	at java.lang.reflect.Method.invoke(Method.java:606)
	at hudson.maven.Maven3Builder.call(Maven3Builder.java:134)
	at hudson.maven.Maven3Builder.call(Maven3Builder.java:69)
	at hudson.remoting.UserRequest.perform(UserRequest.java:118)
	at hudson.remoting.UserRequest.perform(UserRequest.java:48)
	at hudson.remoting.Request$2.run(Request.java:328)
	at hudson.remoting.InterceptingExecutorService$1.call(InterceptingExecutorService.java:72)
	at java.util.concurrent.FutureTask.run(FutureTask.java:262)
	at java.util.concurrent.ThreadPoolExecutor.runWorker(ThreadPoolExecutor.java:1145)
	at java.util.concurrent.ThreadPoolExecutor$Worker.run(ThreadPoolExecutor.java:615)
	at java.lang.Thread.run(Thread.java:745)
Caused by: java.lang.LinkageError: Failed to load com.google.common.collect.AbstractMapBasedMultimap
	at hudson.remoting.RemoteClassLoader.loadClassFile(RemoteClassLoader.java:326)
	at hudson.remoting.RemoteClassLoader.findClass(RemoteClassLoader.java:236)
	at java.lang.ClassLoader.loadClass(ClassLoader.java:425)
	at java.lang.ClassLoader.loadClass(ClassLoader.java:358)
	at java.lang.Class.forName0(Native Method)
	at java.lang.Class.forName(Class.java:270)
	at hudson.remoting.MultiClassLoaderSerializer$Input.resolveClass(MultiClassLoaderSerializer.java:113)
	at java.io.ObjectInputStream.readNonProxyDesc(ObjectInputStream.java:1612)
	at java.io.ObjectInputStream.readClassDesc(ObjectInputStream.java:1517)
	at java.io.ObjectInputStream.readNonProxyDesc(ObjectInputStream.java:1622)
	at java.io.ObjectInputStream.readClassDesc(ObjectInputStream.java:1517)
	at java.io.ObjectInputStream.readNonProxyDesc(ObjectInputStream.java:1622)
	at java.io.ObjectInputStream.readClassDesc(ObjectInputStream.java:1517)
	at java.io.ObjectInputStream.readOrdinaryObject(ObjectInputStream.java:1771)
	at java.io.ObjectInputStream.readObject0(ObjectInputStream.java:1350)
	at java.io.ObjectInputStream.defaultReadFields(ObjectInputStream.java:1990)
	at java.io.ObjectInputStream.readSerialData(ObjectInputStream.java:1915)
	at java.io.ObjectInputStream.readOrdinaryObject(ObjectInputStream.java:1798)
	at java.io.ObjectInputStream.readObject0(ObjectInputStream.java:1350)
	at java.io.ObjectInputStream.defaultReadFields(ObjectInputStream.java:1990)
	at java.io.ObjectInputStream.readSerialData(ObjectInputStream.java:1915)
	at java.io.ObjectInputStream.readOrdinaryObject(ObjectInputStream.java:1798)
	at java.io.ObjectInputStream.readObject0(ObjectInputStream.java:1350)
	at java.io.ObjectInputStream.readArray(ObjectInputStream.java:1706)
	at java.io.ObjectInputStream.readObject0(ObjectInputStream.java:1344)
	at java.io.ObjectInputStream.defaultReadFields(ObjectInputStream.java:1990)
	at java.io.ObjectInputStream.readSerialData(ObjectInputStream.java:1915)
	at java.io.ObjectInputStream.readOrdinaryObject(ObjectInputStream.java:1798)
	at java.io.ObjectInputStream.readObject0(ObjectInputStream.java:1350)
	at java.io.ObjectInputStream.readObject(ObjectInputStream.java:370)
	at hudson.remoting.UserRequest.deserialize(UserRequest.java:182)
	at hudson.remoting.UserRequest.perform(UserRequest.java:98)
	at hudson.remoting.UserRequest.perform(UserRequest.java:48)
	at hudson.remoting.Request$2.run(Request.java:328)
	at hudson.remoting.InterceptingExecutorService$1.call(InterceptingExecutorService.java:72)
	at jenkins.util.ContextResettingExecutorService$2.call(ContextResettingExecutorService.java:46)
	... 4 more
Caused by: java.lang.IllegalAccessError: class com.google.common.collect.AbstractMapBasedMultimap cannot access its superclass com.google.common.collect.AbstractMultimap
	at java.lang.ClassLoader.defineClass1(Native Method)
	at java.lang.ClassLoader.defineClass(ClassLoader.java:800)
	at java.lang.ClassLoader.defineClass(ClassLoader.java:643)
	at hudson.remoting.RemoteClassLoader.loadClassFile(RemoteClassLoader.java:322)
	... 39 more
[INFO] 
[INFO] --- maven-compiler-plugin:2.5.1:testCompile (default-testCompile) @ teeda-jsp-test ---
[INFO] Compiling 2 source files to /home/services/jenkins/jobs/teeda-1.0.13-it-snapshot/workspace/teeda-integration-test/teeda-jsp-test/target/test-classes
[TASKS] Scanning folder '/home/services/jenkins/jobs/teeda-1.0.13-it-snapshot/workspace/teeda-integration-test/teeda-jsp-test' for files matching the pattern '**/*.java' - excludes: 
[TASKS] Found 3 files to scan for tasks
Found 0 open tasks.
[TASKS] ファイルのエンコーディングがpom.xmlで指定されていません。プラットフォームのエンコーディング(UTF-8)を使用します。すなわち、ビルドはプラットフォーム依存となります(<a href="http://docs.codehaus.org/display/MAVENUSER/POM+Element+for+Source+File+Encoding">Maven FAQ</a> 参照)。
java.io.IOException: Remote call on channel failed
	at hudson.remoting.Channel.call(Channel.java:748)
	at hudson.remoting.RemoteInvocationHandler.invoke(RemoteInvocationHandler.java:168)
	at com.sun.proxy.$Proxy7.execute(Unknown Source)
	at hudson.maven.MavenBuildProxy$Filter.execute(MavenBuildProxy.java:206)
	at hudson.plugins.analysis.core.HealthAwareReporter.registerResultsOnMaster(HealthAwareReporter.java:326)
	at hudson.plugins.analysis.core.HealthAwareReporter.postExecute(HealthAwareReporter.java:317)
	at hudson.maven.Maven3Builder$MavenExecutionListener.recordMojoEnded(Maven3Builder.java:628)
	at hudson.maven.Maven3Builder$MavenExecutionListener.mojoSucceeded(Maven3Builder.java:610)
	at hudson.maven.Maven3Builder$JenkinsEventSpy.onEvent(Maven3Builder.java:306)
	at org.apache.maven.eventspy.internal.EventSpyDispatcher.onEvent(EventSpyDispatcher.java:108)
	at org.apache.maven.eventspy.internal.EventSpyExecutionListener.mojoSucceeded(EventSpyExecutionListener.java:131)
	at org.apache.maven.lifecycle.internal.DefaultExecutionEventCatapult.fire(DefaultExecutionEventCatapult.java:87)
	at org.apache.maven.lifecycle.internal.DefaultExecutionEventCatapult.fire(DefaultExecutionEventCatapult.java:42)
	at org.apache.maven.lifecycle.internal.MojoExecutor.execute(MojoExecutor.java:227)
	at org.apache.maven.lifecycle.internal.MojoExecutor.execute(MojoExecutor.java:153)
	at org.apache.maven.lifecycle.internal.MojoExecutor.execute(MojoExecutor.java:145)
	at org.apache.maven.lifecycle.internal.LifecycleModuleBuilder.buildProject(LifecycleModuleBuilder.java:108)
	at org.apache.maven.lifecycle.internal.LifecycleModuleBuilder.buildProject(LifecycleModuleBuilder.java:76)
	at org.apache.maven.lifecycle.internal.builder.singlethreaded.SingleThreadedBuilder.build(SingleThreadedBuilder.java:51)
	at org.apache.maven.lifecycle.internal.LifecycleStarter.execute(LifecycleStarter.java:116)
	at org.apache.maven.DefaultMaven.doExecute(DefaultMaven.java:361)
	at org.apache.maven.DefaultMaven.execute(DefaultMaven.java:155)
	at org.jvnet.hudson.maven3.launcher.Maven31Launcher.main(Maven31Launcher.java:132)
	at sun.reflect.NativeMethodAccessorImpl.invoke0(Native Method)
	at sun.reflect.NativeMethodAccessorImpl.invoke(NativeMethodAccessorImpl.java:57)
	at sun.reflect.DelegatingMethodAccessorImpl.invoke(DelegatingMethodAccessorImpl.java:43)
	at java.lang.reflect.Method.invoke(Method.java:606)
	at org.codehaus.plexus.classworlds.launcher.Launcher.launchStandard(Launcher.java:330)
	at org.codehaus.plexus.classworlds.launcher.Launcher.launch(Launcher.java:238)
	at jenkins.maven3.agent.Maven31Main.launch(Maven31Main.java:181)
	at sun.reflect.NativeMethodAccessorImpl.invoke0(Native Method)
	at sun.reflect.NativeMethodAccessorImpl.invoke(NativeMethodAccessorImpl.java:57)
	at sun.reflect.DelegatingMethodAccessorImpl.invoke(DelegatingMethodAccessorImpl.java:43)
	at java.lang.reflect.Method.invoke(Method.java:606)
	at hudson.maven.Maven3Builder.call(Maven3Builder.java:134)
	at hudson.maven.Maven3Builder.call(Maven3Builder.java:69)
	at hudson.remoting.UserRequest.perform(UserRequest.java:118)
	at hudson.remoting.UserRequest.perform(UserRequest.java:48)
	at hudson.remoting.Request$2.run(Request.java:328)
	at hudson.remoting.InterceptingExecutorService$1.call(InterceptingExecutorService.java:72)
	at java.util.concurrent.FutureTask.run(FutureTask.java:262)
	at java.util.concurrent.ThreadPoolExecutor.runWorker(ThreadPoolExecutor.java:1145)
	at java.util.concurrent.ThreadPoolExecutor$Worker.run(ThreadPoolExecutor.java:615)
	at java.lang.Thread.run(Thread.java:745)
Caused by: java.lang.LinkageError: Failed to load com.google.common.collect.AbstractMapBasedMultimap
	at hudson.remoting.RemoteClassLoader.loadClassFile(RemoteClassLoader.java:326)
	at hudson.remoting.RemoteClassLoader.findClass(RemoteClassLoader.java:236)
	at java.lang.ClassLoader.loadClass(ClassLoader.java:425)
	at java.lang.ClassLoader.loadClass(ClassLoader.java:358)
	at java.lang.Class.forName0(Native Method)
	at java.lang.Class.forName(Class.java:270)
	at hudson.remoting.MultiClassLoaderSerializer$Input.resolveClass(MultiClassLoaderSerializer.java:113)
	at java.io.ObjectInputStream.readNonProxyDesc(ObjectInputStream.java:1612)
	at java.io.ObjectInputStream.readClassDesc(ObjectInputStream.java:1517)
	at java.io.ObjectInputStream.readNonProxyDesc(ObjectInputStream.java:1622)
	at java.io.ObjectInputStream.readClassDesc(ObjectInputStream.java:1517)
	at java.io.ObjectInputStream.readNonProxyDesc(ObjectInputStream.java:1622)
	at java.io.ObjectInputStream.readClassDesc(ObjectInputStream.java:1517)
	at java.io.ObjectInputStream.readOrdinaryObject(ObjectInputStream.java:1771)
	at java.io.ObjectInputStream.readObject0(ObjectInputStream.java:1350)
	at java.io.ObjectInputStream.defaultReadFields(ObjectInputStream.java:1990)
	at java.io.ObjectInputStream.readSerialData(ObjectInputStream.java:1915)
	at java.io.ObjectInputStream.readOrdinaryObject(ObjectInputStream.java:1798)
	at java.io.ObjectInputStream.readObject0(ObjectInputStream.java:1350)
	at java.io.ObjectInputStream.defaultReadFields(ObjectInputStream.java:1990)
	at java.io.ObjectInputStream.readSerialData(ObjectInputStream.java:1915)
	at java.io.ObjectInputStream.readOrdinaryObject(ObjectInputStream.java:1798)
	at java.io.ObjectInputStream.readObject0(ObjectInputStream.java:1350)
	at java.io.ObjectInputStream.readArray(ObjectInputStream.java:1706)
	at java.io.ObjectInputStream.readObject0(ObjectInputStream.java:1344)
	at java.io.ObjectInputStream.defaultReadFields(ObjectInputStream.java:1990)
	at java.io.ObjectInputStream.readSerialData(ObjectInputStream.java:1915)
	at java.io.ObjectInputStream.readOrdinaryObject(ObjectInputStream.java:1798)
	at java.io.ObjectInputStream.readObject0(ObjectInputStream.java:1350)
	at java.io.ObjectInputStream.readObject(ObjectInputStream.java:370)
	at hudson.remoting.UserRequest.deserialize(UserRequest.java:182)
	at hudson.remoting.UserRequest.perform(UserRequest.java:98)
	at hudson.remoting.UserRequest.perform(UserRequest.java:48)
	at hudson.remoting.Request$2.run(Request.java:328)
	at hudson.remoting.InterceptingExecutorService$1.call(InterceptingExecutorService.java:72)
	at jenkins.util.ContextResettingExecutorService$2.call(ContextResettingExecutorService.java:46)
	... 4 more
Caused by: java.lang.IllegalAccessError: class com.google.common.collect.AbstractMapBasedMultimap cannot access its superclass com.google.common.collect.AbstractMultimap
	at java.lang.ClassLoader.defineClass1(Native Method)
	at java.lang.ClassLoader.defineClass(ClassLoader.java:800)
	at java.lang.ClassLoader.defineClass(ClassLoader.java:643)
	at hudson.remoting.RemoteClassLoader.loadClassFile(RemoteClassLoader.java:322)
	... 39 more
[INFO] 
[INFO] --- maven-surefire-plugin:2.12.4:test (default-test) @ teeda-jsp-test ---
[INFO] Surefire report directory: /home/services/jenkins/jobs/teeda-1.0.13-it-snapshot/workspace/teeda-integration-test/teeda-jsp-test/target/surefire-reports

-------------------------------------------------------
 T E S T S
-------------------------------------------------------
Running org.seasar.teeda.it.AllJspTests
found testClass: org.seasar.teeda.it.render.InputRadioTest
pomFile:/home/services/jenkins/jobs/teeda-1.0.13-it-snapshot/workspace/teeda-integration-test/teeda-jsp-test/pom.xml
2014-09-06 02:35:08.461::INFO:  Logging to STDERR via org.mortbay.log.StdErrLog
webapp:/home/services/jenkins/jobs/teeda-1.0.13-it-snapshot/workspace/teeda-integration-test/teeda-jsp-test/target/teeda-jsp-test
### Jetty start ###
2014-09-06 02:35:08.492::INFO:  jetty-6.0.2
DEBUG 02:35:14,562 [main]   ContextRealPath=/home/services/jenkins/jobs/teeda-1.0.13-it-snapshot/workspace/teeda-integration-test/teeda-jsp-test/target/teeda-jsp-test/
  SERVER_SOFTWARE=Jetty-6.0, ServletContextName=/, MajorVersion=2, MinorVersion=5
log4j:WARN No appenders could be found for logger (org.apache.jasper.compiler.JspRuntimeContext).
log4j:WARN Please initialize the log4j system properly.
WARN  02:35:14,685 [main] s2-frameworkのJarファイルが複数あります。バージョン=2.4.47, Jarファイル=[jar:file:/home/services/jenkins/.m2/repository/org/seasar/container/s2-framework/2.4.47/s2-framework-2.4.47.jar!/META-INF/maven/org.seasar.container/s2-framework/pom.properties, jar:file:/home/services/jenkins/jobs/teeda-1.0.13-it-snapshot/workspace/teeda-integration-test/teeda-jsp-test/target/teeda-jsp-test/WEB-INF/lib/s2-framework-2.4.47.jar!/META-INF/maven/org.seasar.container/s2-framework/pom.properties]
WARN  02:35:14,686 [main] s2-extensionのJarファイルが複数あります。バージョン=2.4.47, Jarファイル=[jar:file:/home/services/jenkins/.m2/repository/org/seasar/container/s2-extension/2.4.47/s2-extension-2.4.47.jar!/META-INF/maven/org.seasar.container/s2-extension/pom.properties, jar:file:/home/services/jenkins/jobs/teeda-1.0.13-it-snapshot/workspace/teeda-integration-test/teeda-jsp-test/target/teeda-jsp-test/WEB-INF/lib/s2-extension-2.4.47.jar!/META-INF/maven/org.seasar.container/s2-extension/pom.properties]
WARN  02:35:14,688 [main] s2-tigerのJarファイルが複数あります。バージョン=2.4.47, Jarファイル=[jar:file:/home/services/jenkins/.m2/repository/org/seasar/container/s2-tiger/2.4.47/s2-tiger-2.4.47.jar!/META-INF/maven/org.seasar.container/s2-tiger/pom.properties, jar:file:/home/services/jenkins/jobs/teeda-1.0.13-it-snapshot/workspace/teeda-integration-test/teeda-jsp-test/target/teeda-jsp-test/WEB-INF/lib/s2-tiger-2.4.47.jar!/META-INF/maven/org.seasar.container/s2-tiger/pom.properties]
DEBUG 02:35:14,721 [main] S2Containerを作成します。path=app.dicon
DEBUG 02:35:14,737 [main] S2Containerを作成します。path=convention.dicon
DEBUG 02:35:14,788 [main] S2Containerを作成しました。path=convention.dicon
DEBUG 02:35:14,789 [main] S2Containerを作成します。path=teeda.dicon
DEBUG 02:35:14,813 [main] S2Containerを作成します。path=teedaErrorPage.dicon
DEBUG 02:35:14,818 [main] S2Containerを作成しました。path=teedaErrorPage.dicon
DEBUG 02:35:14,819 [main] S2Containerを作成します。path=teedaCustomize.dicon
DEBUG 02:35:14,825 [main] S2Containerを作成しました。path=teedaCustomize.dicon
DEBUG 02:35:14,915 [main] S2Containerを作成しました。path=teeda.dicon
DEBUG 02:35:14,918 [main] S2Containerを作成しました。path=app.dicon
WARN  02:35:15,098 [main] org.seasar.teeda.extension.render.TViewRootRendererのプロパティ(htmlComponentInvoker)が見つからないので設定をスキップします
WARN  02:35:15,098 [main] org.seasar.teeda.extension.render.TIncludeChildBodyRendererのプロパティ(htmlComponentInvoker)が見つからないので設定をスキップします
WARN  02:35:15,098 [main] org.seasar.teeda.extension.render.TIncludeRendererのプロパティ(htmlComponentInvoker)が見つからないので設定をスキップします
WARN  02:35:15,101 [main] org.seasar.teeda.extension.render.html.THtmlOutputLinkRendererのプロパティ(htmlSuffix)が見つからないので設定をスキップします
INFO  02:35:15,104 [main] Running on [ENV]product, [DEPLOY MODE]Normal Mode
DEBUG 02:35:15,104 [main] Teeda : 1.0.13-sp11
DEBUG 02:35:15,105 [main] sun.io.unicode.encoding       : UnicodeLittle
DEBUG 02:35:15,105 [main] java.version                  : 1.5.0_22
DEBUG 02:35:15,106 [main] java.class.path               : /home/services/jenkins/jobs/teeda-1.0.13-it-snapshot/workspace/teeda-integration-test/teeda-jsp-test/target/test-classes:/home/services/jenkins/jobs/teeda-1.0.13-it-snapshot/workspace/teeda-integration-test/teeda-jsp-test/target/classes:/home/services/jenkins/.m2/repository/org/seasar/teeda/teeda-core/1.0.13-sp11/teeda-core-1.0.13-sp11.jar:/home/services/jenkins/.m2/repository/javax/servlet/jstl/1.1.2/jstl-1.1.2.jar:/home/services/jenkins/.m2/repository/commons-el/commons-el/1.0/commons-el-1.0.jar:/home/services/jenkins/.m2/repository/org/seasar/teeda/teeda-extension/1.0.13-sp11/teeda-extension-1.0.13-sp11.jar:/home/services/jenkins/.m2/repository/org/seasar/teeda/teeda-ajax/1.0.13-sp11/teeda-ajax-1.0.13-sp11.jar:/home/services/jenkins/.m2/repository/commons-fileupload/commons-fileupload/1.2/commons-fileupload-1.2.jar:/home/services/jenkins/.m2/repository/commons-io/commons-io/1.3.2/commons-io-1.3.2.jar:/home/services/jenkins/.m2/repository/org/seasar/container/s2-tiger/2.4.47/s2-tiger-2.4.47.jar:/home/services/jenkins/.m2/repository/org/easymock/easymock/2.4/easymock-2.4.jar:/home/services/jenkins/.m2/repository/org/seasar/container/s2-extension/2.4.47/s2-extension-2.4.47.jar:/home/services/jenkins/.m2/repository/org/apache/poi/poi/3.0-FINAL/poi-3.0-FINAL.jar:/home/services/jenkins/.m2/repository/org/seasar/container/s2-framework/2.4.47/s2-framework-2.4.47.jar:/home/services/jenkins/.m2/repository/aopalliance/aopalliance/1.0/aopalliance-1.0.jar:/home/services/jenkins/.m2/repository/jboss/javassist/3.4.ga/javassist-3.4.ga.jar:/home/services/jenkins/.m2/repository/ognl/ognl/2.6.9-patch-20090427/ognl-2.6.9-patch-20090427.jar:/home/services/jenkins/.m2/repository/commons-logging/commons-logging/1.1/commons-logging-1.1.jar:/home/services/jenkins/.m2/repository/junit/junit/3.8.2/junit-3.8.2.jar:/home/services/jenkins/.m2/repository/org/apache/geronimo/specs/geronimo-servlet_2.4_spec/1.0/geronimo-servlet_2.4_spec-1.0.jar:/home/services/jenkins/.m2/repository/org/apache/geronimo/specs/geronimo-jsp_2.0_spec/1.0/geronimo-jsp_2.0_spec-1.0.jar:/home/services/jenkins/.m2/repository/log4j/log4j/1.2.13/log4j-1.2.13.jar:/home/services/jenkins/.m2/repository/junit-addons/junit-addons/1.4/junit-addons-1.4.jar:/home/services/jenkins/.m2/repository/xerces/xercesImpl/2.6.2/xercesImpl-2.6.2.jar:/home/services/jenkins/.m2/repository/xerces/xmlParserAPIs/2.6.2/xmlParserAPIs-2.6.2.jar:/home/services/jenkins/.m2/repository/org/seasar/teeda/teeda-webunit/0.2.3/teeda-webunit-0.2.3.jar:/home/services/jenkins/.m2/repository/org/apache/maven/maven-embedder/2.0.4/maven-embedder-2.0.4.jar:/home/services/jenkins/.m2/repository/org/apache/maven/maven-core/2.0.4/maven-core-2.0.4.jar:/home/services/jenkins/.m2/repository/org/apache/maven/maven-settings/2.0.4/maven-settings-2.0.4.jar:/home/services/jenkins/.m2/repository/org/apache/maven/wagon/wagon-file/1.0-alpha-7/wagon-file-1.0-alpha-7.jar:/home/services/jenkins/.m2/repository/org/apache/maven/maven-plugin-parameter-documenter/2.0.4/maven-plugin-parameter-documenter-2.0.4.jar:/home/services/jenkins/.m2/repository/org/apache/maven/wagon/wagon-http-lightweight/1.0-alpha-6/wagon-http-lightweight-1.0-alpha-6.jar:/home/services/jenkins/.m2/repository/org/apache/maven/reporting/maven-reporting-api/2.0.4/maven-reporting-api-2.0.4.jar:/home/services/jenkins/.m2/repository/org/apache/maven/doxia/doxia-sink-api/1.0-alpha-7/doxia-sink-api-1.0-alpha-7.jar:/home/services/jenkins/.m2/repository/org/apache/maven/maven-profile/2.0.4/maven-profile-2.0.4.jar:/home/services/jenkins/.m2/repository/org/apache/maven/maven-model/2.0.4/maven-model-2.0.4.jar:/home/services/jenkins/.m2/repository/org/apache/maven/maven-artifact/2.0.4/maven-artifact-2.0.4.jar:/home/services/jenkins/.m2/repository/org/apache/maven/wagon/wagon-provider-api/1.0-alpha-6/wagon-provider-api-1.0-alpha-6.jar:/home/services/jenkins/.m2/repository/org/codehaus/plexus/plexus-container-default/1.0-alpha-9/plexus-container-default-1.0-alpha-9.jar:/home/services/jenkins/.m2/repository/org/apache/maven/maven-repository-metadata/2.0.4/maven-repository-metadata-2.0.4.jar:/home/services/jenkins/.m2/repository/org/apache/maven/maven-error-diagnostics/2.0.4/maven-error-diagnostics-2.0.4.jar:/home/services/jenkins/.m2/repository/org/apache/maven/maven-project/2.0.4/maven-project-2.0.4.jar:/home/services/jenkins/.m2/repository/org/apache/maven/maven-plugin-registry/2.0.4/maven-plugin-registry-2.0.4.jar:/home/services/jenkins/.m2/repository/commons-cli/commons-cli/1.0/commons-cli-1.0.jar:/home/services/jenkins/.m2/repository/org/apache/maven/maven-plugin-api/2.0.4/maven-plugin-api-2.0.4.jar:/home/services/jenkins/.m2/repository/org/apache/maven/wagon/wagon-ssh-external/1.0-alpha-6/wagon-ssh-external-1.0-alpha-6.jar:/home/services/jenkins/.m2/repository/org/apache/maven/maven-plugin-descriptor/2.0.4/maven-plugin-descriptor-2.0.4.jar:/home/services/jenkins/.m2/repository/org/codehaus/plexus/plexus-interactivity-api/1.0-alpha-4/plexus-interactivity-api-1.0-alpha-4.jar:/home/services/jenkins/.m2/repository/org/apache/maven/maven-artifact-manager/2.0.4/maven-artifact-manager-2.0.4.jar:/home/services/jenkins/.m2/repository/org/apache/maven/maven-monitor/2.0.4/maven-monitor-2.0.4.jar:/home/services/jenkins/.m2/repository/org/apache/maven/wagon/wagon-ssh/1.0-alpha-7/wagon-ssh-1.0-alpha-7.jar:/home/services/jenkins/.m2/repository/com/jcraft/jsch/0.1.24/jsch-0.1.24.jar:/home/services/jenkins/.m2/repository/org/codehaus/plexus/plexus-utils/1.1/plexus-utils-1.1.jar:/home/services/jenkins/.m2/repository/classworlds/classworlds/1.1/classworlds-1.1.jar:/home/services/jenkins/.m2/repository/net/sourceforge/jwebunit/jwebunit-htmlunit-plugin/1.4.1/jwebunit-htmlunit-plugin-1.4.1.jar:/home/services/jenkins/.m2/repository/net/sourceforge/jwebunit/jwebunit-core/1.4.1/jwebunit-core-1.4.1.jar:/home/services/jenkins/.m2/repository/regexp/regexp/1.3/regexp-1.3.jar:/home/services/jenkins/.m2/repository/htmlunit/htmlunit/1.11/htmlunit-1.11.jar:/home/services/jenkins/.m2/repository/commons-lang/commons-lang/2.2/commons-lang-2.2.jar:/home/services/jenkins/.m2/repository/commons-httpclient/commons-httpclient/3.0.1/commons-httpclient-3.0.1.jar:/home/services/jenkins/.m2/repository/commons-codec/commons-codec/1.3/commons-codec-1.3.jar:/home/services/jenkins/.m2/repository/rhino/js/1.6R5/js-1.6R5.jar:/home/services/jenkins/.m2/repository/nekohtml/nekohtml/0.9.5/nekohtml-0.9.5.jar:/home/services/jenkins/.m2/repository/org/mortbay/jetty/jetty/6.0.2/jetty-6.0.2.jar:/home/services/jenkins/.m2/repository/org/mortbay/jetty/jetty-util/6.0.2/jetty-util-6.0.2.jar:/home/services/jenkins/.m2/repository/org/mortbay/jetty/servlet-api-2.5/6.0.2/servlet-api-2.5-6.0.2.jar:/home/services/jenkins/.m2/repository/tomcat/jasper-runtime/5.5.15/jasper-runtime-5.5.15.jar:/home/services/jenkins/.m2/repository/javax/servlet/servlet-api/2.4/servlet-api-2.4.jar:/home/services/jenkins/.m2/repository/tomcat/jasper-compiler/5.5.15/jasper-compiler-5.5.15.jar:/home/services/jenkins/.m2/repository/javax/servlet/jsp-api/2.0/jsp-api-2.0.jar:/home/services/jenkins/.m2/repository/ant/ant/1.6.5/ant-1.6.5.jar:/home/services/jenkins/.m2/repository/tomcat/jasper-compiler-jdt/5.5.15/jasper-compiler-jdt-5.5.15.jar:/home/services/jenkins/.m2/repository/org/eclipse/jdt/core/3.1.1/core-3.1.1.jar:/home/services/jenkins/.m2/repository/jaxen/jaxen/1.1-beta-8/jaxen-1.1-beta-8.jar:/home/services/jenkins/.m2/repository/dom4j/dom4j/1.6.1/dom4j-1.6.1.jar:/home/services/jenkins/.m2/repository/xml-apis/xml-apis/1.0.b2/xml-apis-1.0.b2.jar:/home/services/jenkins/.m2/repository/jdom/jdom/1.0/jdom-1.0.jar:/home/services/jenkins/.m2/repository/xom/xom/1.0b3/xom-1.0b3.jar:/home/services/jenkins/.m2/repository/com/ibm/icu/icu4j/2.6.1/icu4j-2.6.1.jar:/home/services/jenkins/.m2/repository/xalan/xalan/2.6.0/xalan-2.6.0.jar:/home/services/jenkins/.m2/repository/org/ccil/cowan/tagsoup/tagsoup/0.9.7/tagsoup-0.9.7.jar:/home/services/jenkins/.m2/repository/portlet-api/portlet-api/1.0/portlet-api-1.0.jar:/home/services/jenkins/.m2/repository/commons-collections/commons-collections/3.1/commons-collections-3.1.jar:/home/services/jenkins/.m2/repository/org/seasar/teeda/teeda-xmlunit/0.1.0/teeda-xmlunit-0.1.0.jar:/home/services/jenkins/.m2/repository/xmlunit/xmlunit/1.0/xmlunit-1.0.jar:
DEBUG 02:35:15,107 [main] java.awt.graphicsenv          : sun.awt.X11GraphicsEnvironment
DEBUG 02:35:15,107 [main] user.language                 : ja
DEBUG 02:35:15,107 [main] surefire.real.class.path      : /home/services/jenkins/jobs/teeda-1.0.13-it-snapshot/workspace/teeda-integration-test/teeda-jsp-test/target/surefire/surefirebooter7411884036664191907.jar
DEBUG 02:35:15,107 [main] sun.os.patch.level            : unknown
DEBUG 02:35:15,107 [main] os.version                    : 2.6.32-431.11.2.el6.x86_64
DEBUG 02:35:15,107 [main] java.specification.vendor     : Sun Microsystems Inc.
DEBUG 02:35:15,107 [main] java.class.version            : 49.0
DEBUG 02:35:15,107 [main] file.encoding                 : UTF-8
DEBUG 02:35:15,108 [main] sun.boot.class.path           : /home/services/jenkins/tools/hudson.model.JDK/JDK-1.5/jre/lib/rt.jar:/home/services/jenkins/tools/hudson.model.JDK/JDK-1.5/jre/lib/i18n.jar:/home/services/jenkins/tools/hudson.model.JDK/JDK-1.5/jre/lib/sunrsasign.jar:/home/services/jenkins/tools/hudson.model.JDK/JDK-1.5/jre/lib/jsse.jar:/home/services/jenkins/tools/hudson.model.JDK/JDK-1.5/jre/lib/jce.jar:/home/services/jenkins/tools/hudson.model.JDK/JDK-1.5/jre/lib/charsets.jar:/home/services/jenkins/tools/hudson.model.JDK/JDK-1.5/jre/classes
DEBUG 02:35:15,108 [main] maven.test.skip               : true
DEBUG 02:35:15,108 [main] java.vm.version               : 1.5.0_22-b03
DEBUG 02:35:15,108 [main] java.io.tmpdir                : /tmp
DEBUG 02:35:15,108 [main] java.home                     : /home/services/jenkins/tools/hudson.model.JDK/JDK-1.5/jre
DEBUG 02:35:15,108 [main] user.name                     : jenkins
DEBUG 02:35:15,108 [main] seasar2.version               : [2.4,)
DEBUG 02:35:15,108 [main] java.specification.name       : Java Platform API Specification
DEBUG 02:35:15,109 [main] java.ext.dirs                 : /home/services/jenkins/tools/hudson.model.JDK/JDK-1.5/jre/lib/ext
DEBUG 02:35:15,109 [main] java.vm.info                  : mixed mode
DEBUG 02:35:15,109 [main] sun.arch.data.model           : 64
DEBUG 02:35:15,109 [main] java.vm.specification.name    : Java Virtual Machine Specification
DEBUG 02:35:15,109 [main] java.vm.specification.version : 1.0
DEBUG 02:35:15,109 [main] sun.cpu.endian                : little
DEBUG 02:35:15,109 [main] sun.management.compiler       : HotSpot 64-Bit Server Compiler
DEBUG 02:35:15,109 [main] path.separator                : :
DEBUG 02:35:15,110 [main] java.vm.name                  : Java HotSpot(TM) 64-Bit Server VM
DEBUG 02:35:15,110 [main] localRepository               : /home/services/jenkins/.m2/repository
DEBUG 02:35:15,110 [main] user.country                  : JP
DEBUG 02:35:15,110 [main] surefire.test.class.path      : /home/services/jenkins/jobs/teeda-1.0.13-it-snapshot/workspace/teeda-integration-test/teeda-jsp-test/target/test-classes:/home/services/jenkins/jobs/teeda-1.0.13-it-snapshot/workspace/teeda-integration-test/teeda-jsp-test/target/classes:/home/services/jenkins/.m2/repository/org/seasar/teeda/teeda-core/1.0.13-sp11/teeda-core-1.0.13-sp11.jar:/home/services/jenkins/.m2/repository/javax/servlet/jstl/1.1.2/jstl-1.1.2.jar:/home/services/jenkins/.m2/repository/commons-el/commons-el/1.0/commons-el-1.0.jar:/home/services/jenkins/.m2/repository/org/seasar/teeda/teeda-extension/1.0.13-sp11/teeda-extension-1.0.13-sp11.jar:/home/services/jenkins/.m2/repository/org/seasar/teeda/teeda-ajax/1.0.13-sp11/teeda-ajax-1.0.13-sp11.jar:/home/services/jenkins/.m2/repository/commons-fileupload/commons-fileupload/1.2/commons-fileupload-1.2.jar:/home/services/jenkins/.m2/repository/commons-io/commons-io/1.3.2/commons-io-1.3.2.jar:/home/services/jenkins/.m2/repository/org/seasar/container/s2-tiger/2.4.47/s2-tiger-2.4.47.jar:/home/services/jenkins/.m2/repository/org/easymock/easymock/2.4/easymock-2.4.jar:/home/services/jenkins/.m2/repository/org/seasar/container/s2-extension/2.4.47/s2-extension-2.4.47.jar:/home/services/jenkins/.m2/repository/org/apache/poi/poi/3.0-FINAL/poi-3.0-FINAL.jar:/home/services/jenkins/.m2/repository/org/seasar/container/s2-framework/2.4.47/s2-framework-2.4.47.jar:/home/services/jenkins/.m2/repository/aopalliance/aopalliance/1.0/aopalliance-1.0.jar:/home/services/jenkins/.m2/repository/jboss/javassist/3.4.ga/javassist-3.4.ga.jar:/home/services/jenkins/.m2/repository/ognl/ognl/2.6.9-patch-20090427/ognl-2.6.9-patch-20090427.jar:/home/services/jenkins/.m2/repository/commons-logging/commons-logging/1.1/commons-logging-1.1.jar:/home/services/jenkins/.m2/repository/junit/junit/3.8.2/junit-3.8.2.jar:/home/services/jenkins/.m2/repository/org/apache/geronimo/specs/geronimo-servlet_2.4_spec/1.0/geronimo-servlet_2.4_spec-1.0.jar:/home/services/jenkins/.m2/repository/org/apache/geronimo/specs/geronimo-jsp_2.0_spec/1.0/geronimo-jsp_2.0_spec-1.0.jar:/home/services/jenkins/.m2/repository/log4j/log4j/1.2.13/log4j-1.2.13.jar:/home/services/jenkins/.m2/repository/junit-addons/junit-addons/1.4/junit-addons-1.4.jar:/home/services/jenkins/.m2/repository/xerces/xercesImpl/2.6.2/xercesImpl-2.6.2.jar:/home/services/jenkins/.m2/repository/xerces/xmlParserAPIs/2.6.2/xmlParserAPIs-2.6.2.jar:/home/services/jenkins/.m2/repository/org/seasar/teeda/teeda-webunit/0.2.3/teeda-webunit-0.2.3.jar:/home/services/jenkins/.m2/repository/org/apache/maven/maven-embedder/2.0.4/maven-embedder-2.0.4.jar:/home/services/jenkins/.m2/repository/org/apache/maven/maven-core/2.0.4/maven-core-2.0.4.jar:/home/services/jenkins/.m2/repository/org/apache/maven/maven-settings/2.0.4/maven-settings-2.0.4.jar:/home/services/jenkins/.m2/repository/org/apache/maven/wagon/wagon-file/1.0-alpha-7/wagon-file-1.0-alpha-7.jar:/home/services/jenkins/.m2/repository/org/apache/maven/maven-plugin-parameter-documenter/2.0.4/maven-plugin-parameter-documenter-2.0.4.jar:/home/services/jenkins/.m2/repository/org/apache/maven/wagon/wagon-http-lightweight/1.0-alpha-6/wagon-http-lightweight-1.0-alpha-6.jar:/home/services/jenkins/.m2/repository/org/apache/maven/reporting/maven-reporting-api/2.0.4/maven-reporting-api-2.0.4.jar:/home/services/jenkins/.m2/repository/org/apache/maven/doxia/doxia-sink-api/1.0-alpha-7/doxia-sink-api-1.0-alpha-7.jar:/home/services/jenkins/.m2/repository/org/apache/maven/maven-profile/2.0.4/maven-profile-2.0.4.jar:/home/services/jenkins/.m2/repository/org/apache/maven/maven-model/2.0.4/maven-model-2.0.4.jar:/home/services/jenkins/.m2/repository/org/apache/maven/maven-artifact/2.0.4/maven-artifact-2.0.4.jar:/home/services/jenkins/.m2/repository/org/apache/maven/wagon/wagon-provider-api/1.0-alpha-6/wagon-provider-api-1.0-alpha-6.jar:/home/services/jenkins/.m2/repository/org/codehaus/plexus/plexus-container-default/1.0-alpha-9/plexus-container-default-1.0-alpha-9.jar:/home/services/jenkins/.m2/repository/org/apache/maven/maven-repository-metadata/2.0.4/maven-repository-metadata-2.0.4.jar:/home/services/jenkins/.m2/repository/org/apache/maven/maven-error-diagnostics/2.0.4/maven-error-diagnostics-2.0.4.jar:/home/services/jenkins/.m2/repository/org/apache/maven/maven-project/2.0.4/maven-project-2.0.4.jar:/home/services/jenkins/.m2/repository/org/apache/maven/maven-plugin-registry/2.0.4/maven-plugin-registry-2.0.4.jar:/home/services/jenkins/.m2/repository/commons-cli/commons-cli/1.0/commons-cli-1.0.jar:/home/services/jenkins/.m2/repository/org/apache/maven/maven-plugin-api/2.0.4/maven-plugin-api-2.0.4.jar:/home/services/jenkins/.m2/repository/org/apache/maven/wagon/wagon-ssh-external/1.0-alpha-6/wagon-ssh-external-1.0-alpha-6.jar:/home/services/jenkins/.m2/repository/org/apache/maven/maven-plugin-descriptor/2.0.4/maven-plugin-descriptor-2.0.4.jar:/home/services/jenkins/.m2/repository/org/codehaus/plexus/plexus-interactivity-api/1.0-alpha-4/plexus-interactivity-api-1.0-alpha-4.jar:/home/services/jenkins/.m2/repository/org/apache/maven/maven-artifact-manager/2.0.4/maven-artifact-manager-2.0.4.jar:/home/services/jenkins/.m2/repository/org/apache/maven/maven-monitor/2.0.4/maven-monitor-2.0.4.jar:/home/services/jenkins/.m2/repository/org/apache/maven/wagon/wagon-ssh/1.0-alpha-7/wagon-ssh-1.0-alpha-7.jar:/home/services/jenkins/.m2/repository/com/jcraft/jsch/0.1.24/jsch-0.1.24.jar:/home/services/jenkins/.m2/repository/org/codehaus/plexus/plexus-utils/1.1/plexus-utils-1.1.jar:/home/services/jenkins/.m2/repository/classworlds/classworlds/1.1/classworlds-1.1.jar:/home/services/jenkins/.m2/repository/net/sourceforge/jwebunit/jwebunit-htmlunit-plugin/1.4.1/jwebunit-htmlunit-plugin-1.4.1.jar:/home/services/jenkins/.m2/repository/net/sourceforge/jwebunit/jwebunit-core/1.4.1/jwebunit-core-1.4.1.jar:/home/services/jenkins/.m2/repository/regexp/regexp/1.3/regexp-1.3.jar:/home/services/jenkins/.m2/repository/htmlunit/htmlunit/1.11/htmlunit-1.11.jar:/home/services/jenkins/.m2/repository/commons-lang/commons-lang/2.2/commons-lang-2.2.jar:/home/services/jenkins/.m2/repository/commons-httpclient/commons-httpclient/3.0.1/commons-httpclient-3.0.1.jar:/home/services/jenkins/.m2/repository/commons-codec/commons-codec/1.3/commons-codec-1.3.jar:/home/services/jenkins/.m2/repository/rhino/js/1.6R5/js-1.6R5.jar:/home/services/jenkins/.m2/repository/nekohtml/nekohtml/0.9.5/nekohtml-0.9.5.jar:/home/services/jenkins/.m2/repository/org/mortbay/jetty/jetty/6.0.2/jetty-6.0.2.jar:/home/services/jenkins/.m2/repository/org/mortbay/jetty/jetty-util/6.0.2/jetty-util-6.0.2.jar:/home/services/jenkins/.m2/repository/org/mortbay/jetty/servlet-api-2.5/6.0.2/servlet-api-2.5-6.0.2.jar:/home/services/jenkins/.m2/repository/tomcat/jasper-runtime/5.5.15/jasper-runtime-5.5.15.jar:/home/services/jenkins/.m2/repository/javax/servlet/servlet-api/2.4/servlet-api-2.4.jar:/home/services/jenkins/.m2/repository/tomcat/jasper-compiler/5.5.15/jasper-compiler-5.5.15.jar:/home/services/jenkins/.m2/repository/javax/servlet/jsp-api/2.0/jsp-api-2.0.jar:/home/services/jenkins/.m2/repository/ant/ant/1.6.5/ant-1.6.5.jar:/home/services/jenkins/.m2/repository/tomcat/jasper-compiler-jdt/5.5.15/jasper-compiler-jdt-5.5.15.jar:/home/services/jenkins/.m2/repository/org/eclipse/jdt/core/3.1.1/core-3.1.1.jar:/home/services/jenkins/.m2/repository/jaxen/jaxen/1.1-beta-8/jaxen-1.1-beta-8.jar:/home/services/jenkins/.m2/repository/dom4j/dom4j/1.6.1/dom4j-1.6.1.jar:/home/services/jenkins/.m2/repository/xml-apis/xml-apis/1.0.b2/xml-apis-1.0.b2.jar:/home/services/jenkins/.m2/repository/jdom/jdom/1.0/jdom-1.0.jar:/home/services/jenkins/.m2/repository/xom/xom/1.0b3/xom-1.0b3.jar:/home/services/jenkins/.m2/repository/com/ibm/icu/icu4j/2.6.1/icu4j-2.6.1.jar:/home/services/jenkins/.m2/repository/xalan/xalan/2.6.0/xalan-2.6.0.jar:/home/services/jenkins/.m2/repository/org/ccil/cowan/tagsoup/tagsoup/0.9.7/tagsoup-0.9.7.jar:/home/services/jenkins/.m2/repository/portlet-api/portlet-api/1.0/portlet-api-1.0.jar:/home/services/jenkins/.m2/repository/commons-collections/commons-collections/3.1/commons-collections-3.1.jar:/home/services/jenkins/.m2/repository/org/seasar/teeda/teeda-xmlunit/0.1.0/teeda-xmlunit-0.1.0.jar:/home/services/jenkins/.m2/repository/xmlunit/xmlunit/1.0/xmlunit-1.0.jar:
DEBUG 02:35:15,111 [main] user.timezone                 : Asia/Tokyo
DEBUG 02:35:15,111 [main] file.separator                : /
DEBUG 02:35:15,111 [main] os.arch                       : amd64
DEBUG 02:35:15,111 [main] sun.boot.library.path         : /home/services/jenkins/tools/hudson.model.JDK/JDK-1.5/jre/lib/amd64
DEBUG 02:35:15,112 [main] file.encoding.pkg             : sun.io
DEBUG 02:35:15,112 [main] line.separator                : 

DEBUG 02:35:15,112 [main] java.vendor.url.bug           : http://java.sun.com/cgi-bin/bugreport.cgi
DEBUG 02:35:15,112 [main] java.vm.vendor                : Sun Microsystems Inc.
DEBUG 02:35:15,112 [main] os.name                       : Linux
DEBUG 02:35:15,112 [main] java.vendor.url               : http://java.sun.com/
DEBUG 02:35:15,112 [main] java.awt.printerjob           : sun.print.PSPrinterJob
DEBUG 02:35:15,112 [main] sun.jnu.encoding              : UTF-8
DEBUG 02:35:15,112 [main] java.vm.specification.vendor  : Sun Microsystems Inc.
DEBUG 02:35:15,113 [main] sun.java.launcher             : SUN_STANDARD
DEBUG 02:35:15,113 [main] java.runtime.name             : Java(TM) 2 Runtime Environment, Standard Edition
DEBUG 02:35:15,113 [main] java.endorsed.dirs            : /home/services/jenkins/tools/hudson.model.JDK/JDK-1.5/jre/lib/endorsed
DEBUG 02:35:15,113 [main] java.runtime.version          : 1.5.0_22-b03
DEBUG 02:35:15,113 [main] sun.cpu.isalist               : 
DEBUG 02:35:15,113 [main] java.library.path             : /home/services/jenkins/tools/hudson.model.JDK/JDK-1.5/jre/lib/amd64/server:/home/services/jenkins/tools/hudson.model.JDK/JDK-1.5/jre/lib/amd64:/home/services/jenkins/tools/hudson.model.JDK/JDK-1.5/jre/../lib/amd64
DEBUG 02:35:15,113 [main] user.dir                      : /home/services/jenkins/jobs/teeda-1.0.13-it-snapshot/workspace/teeda-integration-test/teeda-jsp-test
DEBUG 02:35:15,113 [main] user.home                     : /home/services/jenkins
DEBUG 02:35:15,113 [main] java.specification.version    : 1.5
DEBUG 02:35:15,114 [main] java.vendor                   : Sun Microsystems Inc.
DEBUG 02:35:15,114 [main] basedir                       : /home/services/jenkins/jobs/teeda-1.0.13-it-snapshot/workspace/teeda-integration-test/teeda-jsp-test
DEBUG 02:35:15,116 [main] target file path = org/seasar/teeda/core/core-faces-config.xml
DEBUG 02:35:15,154 [main] target file path = /WEB-INF/lib/
DEBUG 02:35:15,172 [main] target file path = null
DEBUG 02:35:15,172 [main] target file path = /faces-config.xml
2014-09-06 02:35:15.250::INFO:  Started SelectChannelConnector @ localhost:51246
http://localhost:51246/faces/render/inputRadio.jsp
DEBUG 02:35:15,314 [main] Get page for window named '', using WebRequestSettings[<url="http://localhost:51246/faces/render/inputRadio.jsp", SubmitMethod[name=get], EncodingType[name=application/x-www-form-urlencoded], [], {}, null>]
DEBUG 02:35:15,315 [main] Load response for http://localhost:51246/faces/render/inputRadio.jsp
DEBUG 02:35:15,417 [btpool0-2] 

** before *****************************************: /faces
  Request class=org.mortbay.jetty.Request, instance=GET /faces/render/inputRadio.jsp HTTP/1.1
User-Agent: Mozilla/4.0 (compatible; MSIE 6.0b; Windows 98)
Host: localhost:51246
  RequestedSessionId=null
  REQUEST_URI=/faces/render/inputRadio.jsp, SERVLET_PATH=/faces
  CharacterEncoding=UTF-8, ContentLength=-1, ContentType=null, Locale=ja_JP, Locales=ja_JP, Scheme=http, isSecure=false
  SERVER_PROTOCOL=HTTP/1.1, REMOTE_ADDR=127.0.0.1, REMOTE_HOST=127.0.0.1, SERVER_NAME=localhost, SERVER_PORT=51246
  ContextPath=, REQUEST_METHOD=GET, QUERY_STRING=null, PathInfo=/render/inputRadio.jsp, RemoteUser=null
  [header]Host=localhost:51246
  [header]User-Agent=Mozilla/4.0 (compatible; MSIE 6.0b; Windows 98)
  [context]javax.servlet.context.tempdir=/tmp/Jetty_localhost_51246___
  [context]org.seasar.teeda.core.config.webapp.element.WebappConfig=org.seasar.teeda.core.config.webapp.element.impl.WebappConfigImpl@5e53bbfa

DEBUG 02:35:15,425 [btpool0-2] before: RESTORE_VIEW:1, javax.faces.event.PhaseEvent[source=org.seasar.teeda.core.lifecycle.LifecycleImpl@111bda67]
DEBUG 02:35:15,428 [btpool0-2] after: RESTORE_VIEW:1, javax.faces.event.PhaseEvent[source=org.seasar.teeda.core.lifecycle.LifecycleImpl@111bda67]
DEBUG 02:35:15,431 [btpool0-2] before: RENDER_RESPONSE:6, javax.faces.event.PhaseEvent[source=org.seasar.teeda.core.lifecycle.LifecycleImpl@111bda67]
DEBUG 02:35:16,596 [btpool0-2] after: RENDER_RESPONSE:6, javax.faces.event.PhaseEvent[source=org.seasar.teeda.core.lifecycle.LifecycleImpl@111bda67]
DEBUG 02:35:16,597 [btpool0-2] 

** after *****************************************: /faces
  Response class=org.mortbay.jetty.Response, instance=HTTP/1.1 200 
Expires: Thu, 01 Jan 1970 00:00:00 GMT
Set-Cookie: JSESSIONID=1gw281fn7h066;path=/
Content-Language: ja
Content-Type: text/html; charset=UTF-8
  [request]facesContext=org.seasar.teeda.core.context.servlet.ServletFacesContextImpl@17589d3d
  [request]javax.faces.webapp.GLOBAL_ID_VIEW={inputRadioForm=org.seasar.teeda.core.taglib.html.FormTag@3abb1bc4, inputRadioForm:bbb=org.seasar.teeda.core.taglib.html.OutputTextTag@521bfefb, inputRadioForm:submit1=org.seasar.teeda.core.taglib.html.CommandButtonTag@2c013ada, inputRadioForm:aaaa=org.seasar.teeda.extension.taglib.TInputRadioTag@4bed4c8}
  [request]javax.servlet.jsp.jstl.fmt.locale.request=ja
  [request]org.mortbay.jetty.newSessionId=1gw281fn7h066
  [request]org.seasar.teeda.core.scope.impl.DispatchScopeFactory.DISPATCH_SCOPE_KEY=org.seasar.teeda.core.scope.impl.DispatchScope@c8398e7
  [request]postback=false
  [request]selectOneRadio1Bean=org.seasar.teeda.it.SelectOneRadio1Bean@13ab6c1c
  [session]javax.faces.internal.scope.PageScope={null={}}
  [session]javax.faces.internal.scope.RedirectScope={}
  [session]javax.faces.request.charset=UTF-8
  [session]org.seasar.teeda.core.lifecycle.impl.RestoreViewPhase.VIEW_ID_LRU={null=/render/inputRadio.jsp}
  [context]javax.servlet.context.tempdir=/tmp/Jetty_localhost_51246___
  [context]org.seasar.teeda.core.config.webapp.element.WebappConfig=org.seasar.teeda.core.config.webapp.element.impl.WebappConfigImpl@5e53bbfa

DEBUG 02:35:16,724 [main] browser tag not yet handled for class com.gargoylesoftware.htmlunit.javascript.host.ActiveXObject
DEBUG 02:35:16,729 [main] javascript tag not yet handled for class com.gargoylesoftware.htmlunit.javascript.host.Anchor
DEBUG 02:35:16,756 [main] browser tag not yet handled for class com.gargoylesoftware.htmlunit.javascript.host.Popup
DEBUG 02:35:16,775 [main] Property "Object" of com.gargoylesoftware.htmlunit.javascript.host.Window@2b891172 not defined as pure js property
DEBUG 02:35:16,777 [main] Property "Object" of com.gargoylesoftware.htmlunit.javascript.host.Window@2b891172 not defined as pure js property
DEBUG 02:35:16,826 [main] browser tag not yet handled for class com.gargoylesoftware.htmlunit.javascript.host.ActiveXObject
DEBUG 02:35:16,827 [main] javascript tag not yet handled for class com.gargoylesoftware.htmlunit.javascript.host.Anchor
DEBUG 02:35:16,830 [main] browser tag not yet handled for class com.gargoylesoftware.htmlunit.javascript.host.Popup
DEBUG 02:35:16,832 [main] browser tag not yet handled for class com.gargoylesoftware.htmlunit.javascript.host.XMLHttpRequest
DEBUG 02:35:16,832 [main] Mapping com.gargoylesoftware.htmlunit.html.HtmlTableHeader to TableHeader
DEBUG 02:35:16,832 [main] Mapping com.gargoylesoftware.htmlunit.html.HtmlInlineFrame to FrameInline
DEBUG 02:35:16,832 [main]    testing to use HTMLFrameElement
DEBUG 02:35:16,832 [main] Mapping com.gargoylesoftware.htmlunit.html.HtmlTextInput to Text
DEBUG 02:35:16,833 [main]    testing to use HTMLInputElement
DEBUG 02:35:16,833 [main] Mapping com.gargoylesoftware.htmlunit.html.HtmlTable to Table
DEBUG 02:35:16,833 [main] Mapping com.gargoylesoftware.htmlunit.html.HtmlForm to HTMLFormElement
DEBUG 02:35:16,833 [main] Mapping com.gargoylesoftware.htmlunit.html.HtmlLabel to Label
DEBUG 02:35:16,833 [main]    testing to use FocusableHostElement
DEBUG 02:35:16,833 [main] Mapping com.gargoylesoftware.htmlunit.html.HtmlButton to Button
DEBUG 02:35:16,834 [main] Mapping com.gargoylesoftware.htmlunit.html.HtmlPasswordInput to Password
DEBUG 02:35:16,834 [main]    testing to use HTMLInputElement
DEBUG 02:35:16,834 [main] Mapping com.gargoylesoftware.htmlunit.html.HtmlFileInput to FileUpload
DEBUG 02:35:16,834 [main]    testing to use HTMLInputElement
DEBUG 02:35:16,834 [main] Mapping com.gargoylesoftware.htmlunit.html.HtmlHiddenInput to Hidden
DEBUG 02:35:16,834 [main]    testing to use HTMLInputElement
DEBUG 02:35:16,834 [main] Mapping com.gargoylesoftware.htmlunit.html.HtmlRadioButtonInput to Radio
DEBUG 02:35:16,835 [main]    testing to use HTMLInputElement
DEBUG 02:35:16,835 [main] Mapping com.gargoylesoftware.htmlunit.html.HtmlResetInput to Reset
DEBUG 02:35:16,835 [main]    testing to use HTMLInputElement
DEBUG 02:35:16,835 [main] Mapping com.gargoylesoftware.htmlunit.html.HtmlImage to Image
DEBUG 02:35:16,835 [main] Mapping com.gargoylesoftware.htmlunit.html.HtmlSelect to HTMLSelectElement
DEBUG 02:35:16,835 [main] Mapping com.gargoylesoftware.htmlunit.html.HtmlTableFooter to TableFooter
DEBUG 02:35:16,836 [main] Mapping com.gargoylesoftware.htmlunit.html.HtmlTableBody to TableBody
DEBUG 02:35:16,836 [main] Mapping com.gargoylesoftware.htmlunit.html.HtmlOption to Option
DEBUG 02:35:16,836 [main] Mapping com.gargoylesoftware.htmlunit.html.HtmlTableRow to TableRow
DEBUG 02:35:16,836 [main] Mapping com.gargoylesoftware.htmlunit.html.HtmlImageInput to ImageInput
DEBUG 02:35:16,836 [main]    testing to use HTMLInputElement
DEBUG 02:35:16,836 [main] Mapping com.gargoylesoftware.htmlunit.html.HtmlTextArea to HTMLTextAreaElement
DEBUG 02:35:16,837 [main] Mapping com.gargoylesoftware.htmlunit.html.HtmlButtonInput to ButtonInput
DEBUG 02:35:16,837 [main]    testing to use HTMLInputElement
DEBUG 02:35:16,837 [main] Mapping com.gargoylesoftware.htmlunit.html.HtmlCheckBoxInput to Checkbox
DEBUG 02:35:16,837 [main]    testing to use HTMLInputElement
DEBUG 02:35:16,837 [main] Mapping com.gargoylesoftware.htmlunit.html.HtmlTableCell to TableCell
DEBUG 02:35:16,837 [main] Mapping com.gargoylesoftware.htmlunit.html.DomText to TextImpl
DEBUG 02:35:16,838 [main] Mapping com.gargoylesoftware.htmlunit.html.HtmlSubmitInput to Submit
DEBUG 02:35:16,838 [main]    testing to use HTMLInputElement
DEBUG 02:35:16,838 [main] Mapping com.gargoylesoftware.htmlunit.html.HtmlAnchor to Anchor
DEBUG 02:35:16,838 [main] Mapping com.gargoylesoftware.htmlunit.html.HtmlElement to HTMLElement
DEBUG 02:35:16,838 [main] Mapping com.gargoylesoftware.htmlunit.html.HtmlArea to Area
DEBUG 02:35:16,838 [main]    testing to use FocusableHostElement
DEBUG 02:35:16,838 [main] Mapping com.gargoylesoftware.htmlunit.html.HtmlFrame to HTMLFrameElement
<html>
<head>
<title>inputRadio</title>
</head>
<body>

	<form id="inputRadioForm" name="inputRadioForm" method="post" enctype="application/x-www-form-urlencoded" action="/faces/render/inputRadio.jsp;jsessionid=1gw281fn7h066">
		
			<input type="radio" name="inputRadioForm:aaaa" value="1" />One
			<input type="radio" name="inputRadioForm:aaaa" checked="checked" value="2" />Two
			<input type="radio" name="inputRadioForm:aaaa" value="3" />Three
		
		<span id="bbb">2</span>
		<input type="submit" id="submit1" name="inputRadioForm:submit1" />
	<input type="hidden" name="inputRadioForm/render/inputRadio.jsp" value="inputRadioForm" /></form>

</body>
</html>
recover: jsessionid
recover:TEXT_VALUE
recover:TEXT_VALUE
recover:TEXT_VALUE
DEBUG 02:35:16,860 [main] Get page for window named '', using WebRequestSettings[<url="http://localhost:51246/faces/render/inputRadio.jsp;jsessionid=1gw281fn7h066", SubmitMethod[name=post], EncodingType[name=application/x-www-form-urlencoded], [KeyValuePair("inputRadioForm:aaaa", "3"), KeyValuePair("inputRadioForm:submit1", ""), KeyValuePair("inputRadioForm/render/inputRadio.jsp", "inputRadioForm")], {}, null>]
DEBUG 02:35:16,860 [main] Load response for http://localhost:51246/faces/render/inputRadio.jsp;jsessionid=1gw281fn7h066
DEBUG 02:35:16,869 [btpool0-2] 

** before *****************************************: /faces
  Request class=org.mortbay.jetty.Request, instance=POST /faces/render/inputRadio.jsp;jsessionid=1gw281fn7h066 HTTP/1.1
User-Agent: Mozilla/4.0 (compatible; MSIE 6.0b; Windows 98)
Host: localhost:51246
Cookie: $Version=0; JSESSIONID=1gw281fn7h066; $Path=/
Content-Length: 105
Content-Type: application/x-www-form-urlencoded
  RequestedSessionId=1gw281fn7h066
  REQUEST_URI=/faces/render/inputRadio.jsp;jsessionid=1gw281fn7h066, SERVLET_PATH=/faces
  CharacterEncoding=UTF-8, ContentLength=105, ContentType=application/x-www-form-urlencoded, Locale=ja_JP, Locales=ja_JP, Scheme=http, isSecure=false
  SERVER_PROTOCOL=HTTP/1.1, REMOTE_ADDR=127.0.0.1, REMOTE_HOST=127.0.0.1, SERVER_NAME=localhost, SERVER_PORT=51246
  ContextPath=, REQUEST_METHOD=POST, QUERY_STRING=null, PathInfo=/render/inputRadio.jsp, RemoteUser=null
  Session SessionId=1gw281fn7h066
  Session :: CreationTime=1409938515423, LastAccessedTime=1409938516867, MaxInactiveInterval=1800
  [param]inputRadioForm/render/inputRadio.jsp=inputRadioForm
  [param]inputRadioForm:aaaa=3
  [param]inputRadioForm:submit1=
  [cookie]JSESSIONID=1gw281fn7h066
  [header]Content-Length=105
  [header]Content-Type=application/x-www-form-urlencoded
  [header]Cookie=$Version=0; JSESSIONID=1gw281fn7h066; $Path=/
  [header]Host=localhost:51246
  [header]User-Agent=Mozilla/4.0 (compatible; MSIE 6.0b; Windows 98)
  [session]javax.faces.internal.scope.PageScope={null={}}
  [session]javax.faces.internal.scope.RedirectScope={}
  [session]javax.faces.request.charset=UTF-8
  [session]org.seasar.teeda.core.lifecycle.impl.RestoreViewPhase.VIEW_ID_LRU={null=/render/inputRadio.jsp}
  [context]javax.servlet.context.tempdir=/tmp/Jetty_localhost_51246___
  [context]org.seasar.teeda.core.config.webapp.element.WebappConfig=org.seasar.teeda.core.config.webapp.element.impl.WebappConfigImpl@5e53bbfa

DEBUG 02:35:16,870 [btpool0-2] before: RESTORE_VIEW:1, javax.faces.event.PhaseEvent[source=org.seasar.teeda.core.lifecycle.LifecycleImpl@111bda67]
DEBUG 02:35:16,871 [btpool0-2] after: RESTORE_VIEW:1, javax.faces.event.PhaseEvent[source=org.seasar.teeda.core.lifecycle.LifecycleImpl@111bda67]
DEBUG 02:35:16,871 [btpool0-2] before: APPLY_REQUEST_VALUES:2, javax.faces.event.PhaseEvent[source=org.seasar.teeda.core.lifecycle.LifecycleImpl@111bda67]
DEBUG 02:35:16,872 [btpool0-2] after: APPLY_REQUEST_VALUES:2, javax.faces.event.PhaseEvent[source=org.seasar.teeda.core.lifecycle.LifecycleImpl@111bda67]
DEBUG 02:35:16,872 [btpool0-2] before: PROCESS_VALIDATIONS:3, javax.faces.event.PhaseEvent[source=org.seasar.teeda.core.lifecycle.LifecycleImpl@111bda67]
DEBUG 02:35:16,873 [btpool0-2] after: PROCESS_VALIDATIONS:3, javax.faces.event.PhaseEvent[source=org.seasar.teeda.core.lifecycle.LifecycleImpl@111bda67]
DEBUG 02:35:16,873 [btpool0-2] before: UPDATE_MODEL_VALUES:4, javax.faces.event.PhaseEvent[source=org.seasar.teeda.core.lifecycle.LifecycleImpl@111bda67]
DEBUG 02:35:16,873 [btpool0-2] after: UPDATE_MODEL_VALUES:4, javax.faces.event.PhaseEvent[source=org.seasar.teeda.core.lifecycle.LifecycleImpl@111bda67]
DEBUG 02:35:16,873 [btpool0-2] before: INVOKE_APPLICATIONS:5, javax.faces.event.PhaseEvent[source=org.seasar.teeda.core.lifecycle.LifecycleImpl@111bda67]
DEBUG 02:35:16,874 [btpool0-2] after: INVOKE_APPLICATIONS:5, javax.faces.event.PhaseEvent[source=org.seasar.teeda.core.lifecycle.LifecycleImpl@111bda67]
DEBUG 02:35:16,874 [btpool0-2] before: RENDER_RESPONSE:6, javax.faces.event.PhaseEvent[source=org.seasar.teeda.core.lifecycle.LifecycleImpl@111bda67]
DEBUG 02:35:16,879 [main] Property "Object" of com.gargoylesoftware.htmlunit.javascript.host.Window@6fc9fe7e not defined as pure js property
DEBUG 02:35:16,879 [main] Property "Object" of com.gargoylesoftware.htmlunit.javascript.host.Window@6fc9fe7e not defined as pure js property
<html>
<head>
<title>inputRadio</title>
</head>
<body>

	<form id="inputRadioForm" name="inputRadioForm" method="post" enctype="application/x-www-form-urlencoded" submitted="true" action="/faces/render/inputRadio.jsp">
		
			<input type="radio" name="inputRadioForm:aaaa" value="1" />One
			<input type="radio" name="inputRadioForm:aaaa" value="2" />Two
			<input type="radio" name="inputRadioForm:aaaa" checked="checked" value="3" />Three
		
		<span id="bbb">3</span>
		<input type="submit" id="submit1" name="inputRadioForm:submit1" />
	<input type="hidden" name="inputRadioForm/render/inputRadio.jsp" value="inputRadioForm" /></form>

</body>
</html>
### Jetty stop ###
DEBUG 02:35:16,884 [btpool0-2] after: RENDER_RESPONSE:6, javax.faces.event.PhaseEvent[source=org.seasar.teeda.core.lifecycle.LifecycleImpl@111bda67]
DEBUG 02:35:16,885 [btpool0-2] 

** after *****************************************: /faces
  Response class=org.mortbay.jetty.Response, instance=HTTP/1.1 200 
Content-Language: ja
Content-Type: text/html; charset=UTF-8
  [request]facesContext=org.seasar.teeda.core.context.servlet.ServletFacesContextImpl@7d6d4e3e
  [request]javax.faces.webapp.GLOBAL_ID_VIEW={inputRadioForm=org.seasar.teeda.core.taglib.html.FormTag@3abb1bc4, inputRadioForm:bbb=org.seasar.teeda.core.taglib.html.OutputTextTag@521bfefb, inputRadioForm:submit1=org.seasar.teeda.core.taglib.html.CommandButtonTag@2c013ada, inputRadioForm:aaaa=org.seasar.teeda.extension.taglib.TInputRadioTag@4bed4c8}
  [request]javax.servlet.jsp.jstl.fmt.locale.request=ja
  [request]org.seasar.teeda.core.lifecycle.LifecycleImpl.EXECUTED=org.seasar.teeda.core.lifecycle.LifecycleImpl.EXECUTED
  [request]org.seasar.teeda.core.scope.impl.DispatchScopeFactory.DISPATCH_SCOPE_KEY=org.seasar.teeda.core.scope.impl.DispatchScope@132c08c7
  [request]postback=true
  [request]previousViewId=/render/inputRadio.jsp
  [request]selectOneRadio1Bean=org.seasar.teeda.it.SelectOneRadio1Bean@2ff44aa6
  [request]teeda.SUBMITTED_COMMAND=submit1
  [cookie]JSESSIONID=1gw281fn7h066
  [session]javax.faces.internal.scope.PageScope={null={}}
  [session]javax.faces.internal.scope.RedirectScope={}
  [session]javax.faces.request.charset=UTF-8
  [session]org.seasar.teeda.core.lifecycle.impl.RestoreViewPhase.VIEW_ID_LRU={null=/render/inputRadio.jsp}
  [context]javax.servlet.context.tempdir=/tmp/Jetty_localhost_51246___
  [context]org.seasar.teeda.core.config.webapp.element.WebappConfig=org.seasar.teeda.core.config.webapp.element.impl.WebappConfigImpl@5e53bbfa

stopped.
Tests run: 1, Failures: 0, Errors: 0, Skipped: 0, Time elapsed: 12.096 sec

Results :

Tests run: 1, Failures: 0, Errors: 0, Skipped: 0

[TASKS] Scanning folder '/home/services/jenkins/jobs/teeda-1.0.13-it-snapshot/workspace/teeda-integration-test/teeda-jsp-test' for files matching the pattern '**/*.java' - excludes: 
[TASKS] Found 3 files to scan for tasks
Found 0 open tasks.
[TASKS] ファイルのエンコーディングがpom.xmlで指定されていません。プラットフォームのエンコーディング(UTF-8)を使用します。すなわち、ビルドはプラットフォーム依存となります(<a href="http://docs.codehaus.org/display/MAVENUSER/POM+Element+for+Source+File+Encoding">Maven FAQ</a> 参照)。
java.io.IOException: Remote call on channel failed
	at hudson.remoting.Channel.call(Channel.java:748)
	at hudson.remoting.RemoteInvocationHandler.invoke(RemoteInvocationHandler.java:168)
	at com.sun.proxy.$Proxy7.execute(Unknown Source)
	at hudson.maven.MavenBuildProxy$Filter.execute(MavenBuildProxy.java:206)
	at hudson.plugins.analysis.core.HealthAwareReporter.registerResultsOnMaster(HealthAwareReporter.java:326)
	at hudson.plugins.analysis.core.HealthAwareReporter.postExecute(HealthAwareReporter.java:317)
	at hudson.maven.Maven3Builder$MavenExecutionListener.recordMojoEnded(Maven3Builder.java:628)
	at hudson.maven.Maven3Builder$MavenExecutionListener.mojoSucceeded(Maven3Builder.java:610)
	at hudson.maven.Maven3Builder$JenkinsEventSpy.onEvent(Maven3Builder.java:306)
	at org.apache.maven.eventspy.internal.EventSpyDispatcher.onEvent(EventSpyDispatcher.java:108)
	at org.apache.maven.eventspy.internal.EventSpyExecutionListener.mojoSucceeded(EventSpyExecutionListener.java:131)
	at org.apache.maven.lifecycle.internal.DefaultExecutionEventCatapult.fire(DefaultExecutionEventCatapult.java:87)
	at org.apache.maven.lifecycle.internal.DefaultExecutionEventCatapult.fire(DefaultExecutionEventCatapult.java:42)
	at org.apache.maven.lifecycle.internal.MojoExecutor.execute(MojoExecutor.java:227)
	at org.apache.maven.lifecycle.internal.MojoExecutor.execute(MojoExecutor.java:153)
	at org.apache.maven.lifecycle.internal.MojoExecutor.execute(MojoExecutor.java:145)
	at org.apache.maven.lifecycle.internal.LifecycleModuleBuilder.buildProject(LifecycleModuleBuilder.java:108)
	at org.apache.maven.lifecycle.internal.LifecycleModuleBuilder.buildProject(LifecycleModuleBuilder.java:76)
	at org.apache.maven.lifecycle.internal.builder.singlethreaded.SingleThreadedBuilder.build(SingleThreadedBuilder.java:51)
	at org.apache.maven.lifecycle.internal.LifecycleStarter.execute(LifecycleStarter.java:116)
	at org.apache.maven.DefaultMaven.doExecute(DefaultMaven.java:361)
	at org.apache.maven.DefaultMaven.execute(DefaultMaven.java:155)
	at org.jvnet.hudson.maven3.launcher.Maven31Launcher.main(Maven31Launcher.java:132)
	at sun.reflect.NativeMethodAccessorImpl.invoke0(Native Method)
	at sun.reflect.NativeMethodAccessorImpl.invoke(NativeMethodAccessorImpl.java:57)
	at sun.reflect.DelegatingMethodAccessorImpl.invoke(DelegatingMethodAccessorImpl.java:43)
	at java.lang.reflect.Method.invoke(Method.java:606)
	at org.codehaus.plexus.classworlds.launcher.Launcher.launchStandard(Launcher.java:330)
	at org.codehaus.plexus.classworlds.launcher.Launcher.launch(Launcher.java:238)
	at jenkins.maven3.agent.Maven31Main.launch(Maven31Main.java:181)
	at sun.reflect.NativeMethodAccessorImpl.invoke0(Native Method)
	at sun.reflect.NativeMethodAccessorImpl.invoke(NativeMethodAccessorImpl.java:57)
	at sun.reflect.DelegatingMethodAccessorImpl.invoke(DelegatingMethodAccessorImpl.java:43)
	at java.lang.reflect.Method.invoke(Method.java:606)
	at hudson.maven.Maven3Builder.call(Maven3Builder.java:134)
	at hudson.maven.Maven3Builder.call(Maven3Builder.java:69)
	at hudson.remoting.UserRequest.perform(UserRequest.java:118)
	at hudson.remoting.UserRequest.perform(UserRequest.java:48)
	at hudson.remoting.Request$2.run(Request.java:328)
	at hudson.remoting.InterceptingExecutorService$1.call(InterceptingExecutorService.java:72)
	at java.util.concurrent.FutureTask.run(FutureTask.java:262)
	at java.util.concurrent.ThreadPoolExecutor.runWorker(ThreadPoolExecutor.java:1145)
	at java.util.concurrent.ThreadPoolExecutor$Worker.run(ThreadPoolExecutor.java:615)
	at java.lang.Thread.run(Thread.java:745)
Caused by: java.lang.LinkageError: Failed to load com.google.common.collect.AbstractMapBasedMultimap
	at hudson.remoting.RemoteClassLoader.loadClassFile(RemoteClassLoader.java:326)
	at hudson.remoting.RemoteClassLoader.findClass(RemoteClassLoader.java:236)
	at java.lang.ClassLoader.loadClass(ClassLoader.java:425)
	at java.lang.ClassLoader.loadClass(ClassLoader.java:358)
	at java.lang.Class.forName0(Native Method)
	at java.lang.Class.forName(Class.java:270)
	at hudson.remoting.MultiClassLoaderSerializer$Input.resolveClass(MultiClassLoaderSerializer.java:113)
	at java.io.ObjectInputStream.readNonProxyDesc(ObjectInputStream.java:1612)
	at java.io.ObjectInputStream.readClassDesc(ObjectInputStream.java:1517)
	at java.io.ObjectInputStream.readNonProxyDesc(ObjectInputStream.java:1622)
	at java.io.ObjectInputStream.readClassDesc(ObjectInputStream.java:1517)
	at java.io.ObjectInputStream.readNonProxyDesc(ObjectInputStream.java:1622)
	at java.io.ObjectInputStream.readClassDesc(ObjectInputStream.java:1517)
	at java.io.ObjectInputStream.readOrdinaryObject(ObjectInputStream.java:1771)
	at java.io.ObjectInputStream.readObject0(ObjectInputStream.java:1350)
	at java.io.ObjectInputStream.defaultReadFields(ObjectInputStream.java:1990)
	at java.io.ObjectInputStream.readSerialData(ObjectInputStream.java:1915)
	at java.io.ObjectInputStream.readOrdinaryObject(ObjectInputStream.java:1798)
	at java.io.ObjectInputStream.readObject0(ObjectInputStream.java:1350)
	at java.io.ObjectInputStream.defaultReadFields(ObjectInputStream.java:1990)
	at java.io.ObjectInputStream.readSerialData(ObjectInputStream.java:1915)
	at java.io.ObjectInputStream.readOrdinaryObject(ObjectInputStream.java:1798)
	at java.io.ObjectInputStream.readObject0(ObjectInputStream.java:1350)
	at java.io.ObjectInputStream.readArray(ObjectInputStream.java:1706)
	at java.io.ObjectInputStream.readObject0(ObjectInputStream.java:1344)
	at java.io.ObjectInputStream.defaultReadFields(ObjectInputStream.java:1990)
	at java.io.ObjectInputStream.readSerialData(ObjectInputStream.java:1915)
	at java.io.ObjectInputStream.readOrdinaryObject(ObjectInputStream.java:1798)
	at java.io.ObjectInputStream.readObject0(ObjectInputStream.java:1350)
	at java.io.ObjectInputStream.readObject(ObjectInputStream.java:370)
	at hudson.remoting.UserRequest.deserialize(UserRequest.java:182)
	at hudson.remoting.UserRequest.perform(UserRequest.java:98)
	at hudson.remoting.UserRequest.perform(UserRequest.java:48)
	at hudson.remoting.Request$2.run(Request.java:328)
	at hudson.remoting.InterceptingExecutorService$1.call(InterceptingExecutorService.java:72)
	at jenkins.util.ContextResettingExecutorService$2.call(ContextResettingExecutorService.java:46)
	... 4 more
Caused by: java.lang.IllegalAccessError: class com.google.common.collect.AbstractMapBasedMultimap cannot access its superclass com.google.common.collect.AbstractMultimap
	at java.lang.ClassLoader.defineClass1(Native Method)
	at java.lang.ClassLoader.defineClass(ClassLoader.java:800)
	at java.lang.ClassLoader.defineClass(ClassLoader.java:643)
	at hudson.remoting.RemoteClassLoader.loadClassFile(RemoteClassLoader.java:322)
	... 39 more
[JENKINS] テスト結果の記録